FAQ Search Today's Posts Mark Forums Read
» Video Reviews

» Linux Archive

Linux-archive is a website aiming to archive linux email lists and to make them easily accessible for linux users/developers.


» Sponsor

» Partners

» Sponsor

Go Back   Linux Archive > Gentoo > Gentoo User

 
 
LinkBack Thread Tools
 
Old 05-06-2011, 07:59 AM
Alan McKinnon
 
Default checking whether the C compiler works... no Oooops !!

This is usually CFLAGS and other bits of env stuff. There's probably a more
meaningful error earlier in the build log.

Can you post the full log for a failing file?


Apparently, though unproven, at 09:45 on Friday 06 May 2011, Dale did opine
thusly:

> Hi,
>
> I'm trying to update my old rig, the x86 one. It is about 2 months or
> so behind. I wanted to get it ready for the latest KDE for my brother
> to play on. I keep running into this type of error:
>
> checking whether make sets $(MAKE)... yes
> checking whether to disable maintainer-specific portions of Makefiles...
> yes checking for i686-pc-linux-gnu-gcc... gcc
> checking whether the C compiler works... no
> configure: error: in
> `/var/tmp/portage/x11-libs/gdk-pixbuf-2.22.1/work/gdk-pixbuf-2.22.1':
> configure: error: C compiler cannot create executables
> See `config.log' for more details.
>
> !!! Please attach the following file when seeking support:
> !!!
> /var/tmp/portage/x11-libs/gdk-pixbuf-2.22.1/work/gdk-pixbuf-2.22.1/config.l
> og * ERROR: x11-libs/gdk-pixbuf-2.22.1 failed (configure phase):
> * econf failed
>
>
> This happens with LOTS of packages. I did a google search and found
> some really old threads and tried a few things but nothing seems to
> work. This is emerge info:
>
> root@smoker ~ # emerge --info
> Portage 2.2.0_alpha31 (default/linux/x86/10.0/desktop/kde, gcc-4.4.4,
> glibc-2.11.2-r3, 2.6.36-gentoo-r5 i686)
> ================================================== ===============
> System uname:
> Linux-2.6.36-gentoo-r5-i686-AMD_Athlon-tm-_XP_2500+-with-gentoo-1.12.14
> Timestamp of tree: Fri, 06 May 2011 00:15:01 +0000
> app-shells/bash: 4.1_p9
> dev-java/java-config: 2.1.11-r3
> dev-lang/python: 2.6.6-r1, 2.7.1-r1, 3.1.3-r1
> dev-util/cmake: 2.8.1-r2
> sys-apps/baselayout: 1.12.14-r1
> sys-apps/sandbox: 2.4
> sys-devel/autoconf: 2.13, 2.65-r1
> sys-devel/automake: 1.9.6-r3, 1.10.3, 1.11.1
> sys-devel/binutils: 2.20.1-r1
> sys-devel/gcc: 4.4.4-r2
> sys-devel/gcc-config: 1.4.1-r1
> sys-devel/libtool: 2.2.10
> sys-devel/make: 3.81-r2
> sys-kernel/linux-headers: 2.6.36.1 (virtual/os-headers)
> sys-libs/glibc: 2.11.2-r3
> Repositories: gentoo
> Installed sets: @system, @xorg-drivers
> ACCEPT_KEYWORDS="x86"
> ACCEPT_LICENSE="*"
> CBUILD="i686-pc-linux-gnu"
> CFLAGS="-march=native -O2 -pipe -fomit-frame-pointer"
> CHOST="i686-pc-linux-gnu"
> CONFIG_PROTECT="/etc /usr/share/config /var/lib/hsqldb"
> CONFIG_PROTECT_MASK="/etc/ca-certificates.conf /etc/env.d
> /etc/env.d/java/ /etc/fonts/fonts.conf /etc/gconf /etc/revdep-rebuild
> /etc/sandbox.d /etc/terminfo"
> CXXFLAGS="-march=native -O2 -pipe -fomit-frame-pointer"
> DISTDIR="/usr/portage/distfiles"
> EMERGE_DEFAULT_OPTS="--with-bdeps y --backtrack=30"
> FEATURES="assume-digests binpkg-logs buildpkg distlocks fixlafiles
> fixpackages news parallel-fetch preserve-libs protect-owned sandbox
> sfperms strict unknown-features-warn unmerge-logs unmerge-orphans
> userfetch" FFLAGS=""
> GENTOO_MIRRORS="http://distfiles.gentoo.org"
> LANG="en_US"
> LC_ALL="en_US.utf8"
> LDFLAGS="-Wl,-O1 -Wl,--as-needed"
> LINGUAS="en_US en"
> MAKEOPTS="-j2"
> PKGDIR="/usr/portage/packages"
> PORTAGE_CONFIGROOT="/"
> PORTAGE_RSYNC_EXTRA_OPTS="--timeout=600"
> PORTAGE_RSYNC_OPTS="--recursive --links --safe-links --perms --times
> --compress --force --whole-file --delete --stats --timeout=180
> --exclude=/distfiles --exclude=/local --exclude=/packages"
> PORTAGE_TMPDIR="/var/tmp"
> PORTDIR="/usr/portage"
> PORTDIR_OVERLAY=""
>
> Unset: CPPFLAGS, CTARGET, INSTALL_MASK, PORTAGE_BUNZIP2_COMMAND,
> PORTAGE_COMPRESS, PORTAGE_COMPRESS_FLAGS
>
> root@smoker ~ #
>
> I left out the USE line. It needs cleaning. lol This is a list of the
> packages that have failed so far:
>
> =sys-kernel/linux-headers-2.6.36.1
> =sys-libs/glibc-2.11.3
> =sys-devel/binutils-2.20.1-r1
> =sys-libs/zlib-1.2.5-r2
> =dev-libs/expat-2.0.1-r3
> =app-arch/xz-utils-5.0.1
> =app-arch/bzip2-1.0.6
> =media-libs/libogg-1.2.0
> =app-misc/pax-utils-0.2.2
> =app-arch/cpio-2.11
> =dev-libs/gmp-4.3.2
> =app-text/libpaper-1.1.23
> =media-libs/openjpeg-1.3-r3
> =sys-apps/tcp-wrappers-7.6-r8
> =app-portage/portage-utils-0.3.1
> =dev-libs/nspr-4.8.7
> =sys-libs/timezone-data-2011d
> =media-libs/jbigkit-2.0-r1
> =sys-fs/sysfsutils-2.1.0
> =sys-libs/libutempter-1.1.5
> =dev-libs/libx86-1.1-r1
> =sys-apps/sdparm-1.03
> =media-libs/libdvbpsi-0.1.6
> =dev-libs/libevent-2.0.10
> =dev-libs/libdaemon-0.14-r1
> =dev-libs/libusb-1.0.8
> =media-libs/jpeg-8b
> =dev-libs/libffi-3.0.9-r2
> =sys-devel/patch-2.5.9
> =sys-apps/which-2.20
> =dev-util/gperf-3.0.4
> =dev-lang/swig-1.3.40-r1
> =sys-devel/m4-1.4.15
> =media-libs/libpng-1.4.5
> =app-arch/unzip-6.0-r1
> =sys-apps/pciutils-3.1.7
> =dev-libs/mpfr-3.0.0_p3
> =sys-apps/sandbox-2.4
>
> It only has one gcc installed and it is selected:
>
> root@smoker / # gcc-config -l
> [1] i686-pc-linux-gnu-4.4.4 *
> root@smoker / #
>
> Can anyone see what I am missing? I got to be missing something. It
> won't even do a emerge -e system right now.
>
> Thanks.
>
> Dale
>
> :-) :-)

--
alan dot mckinnon at gmail dot com
 
Old 05-06-2011, 08:28 AM
Dale
 
Default checking whether the C compiler works... no Oooops !!

Alan McKinnon wrote:

This is usually CFLAGS and other bits of env stuff. There's probably a more
meaningful error earlier in the build log.

Can you post the full log for a failing file?




Here is one:

>>> Emerging (1 of 5) x11-libs/gdk-pixbuf-2.22.1
* gdk-pixbuf-2.22.1.tar.bz2 RMD160 SHA1 SHA256 size ;-)
...
[ ok ]

* Package: x11-libs/gdk-pixbuf-2.22.1
* Repository: gentoo
* Maintainer: gnome@gentoo.org
* USE: X consolekit elibc_glibc jpeg jpeg2k kernel_linux
policykit tiff userland_GNU x86

* FEATURES: preserve-libs
>>> Unpacking source...
>>> Unpacking gdk-pixbuf-2.22.1.tar.bz2 to
/var/tmp/portage/x11-libs/gdk-pixbuf-2.22.1/work

>>> Source unpacked in /var/tmp/portage/x11-libs/gdk-pixbuf-2.22.1/work
>>> Preparing source in
/var/tmp/portage/x11-libs/gdk-pixbuf-2.22.1/work/gdk-pixbuf-2.22.1 ...
* Applying gdk-pixbuf-2.21.4-fix-automagic-x11.patch
...
[ ok ]
* Applying gdk-pixbuf-2.22.1-fix-libpng15.patch
...
[ ok ]

* Running elibtoolize in: gdk-pixbuf-2.22.1/
* Applying portage-2.2.patch ...
* Applying sed-1.5.6.patch ...
* Applying as-needed-2.2.6.patch ...
* Running eautoreconf in
'/var/tmp/portage/x11-libs/gdk-pixbuf-2.22.1/work/gdk-pixbuf-2.22.1' ...
* Running aclocal -I m4
...
[ ok ]
* Running libtoolize --copy --force --install --automake
...
[ ok ]
* Running aclocal -I m4
...
[ ok ]
* Running autoconf
...
[ ok ]
* Running autoheader
...
[ ok ]
* Running automake --add-missing --copy --foreign
...
[ ok ]

>>> Source prepared.
>>> Configuring source in
/var/tmp/portage/x11-libs/gdk-pixbuf-2.22.1/work/gdk-pixbuf-2.22.1 ...
* econf: updating gdk-pixbuf-2.22.1/config.guess with
/usr/share/gnuconfig/config.guess
* econf: updating gdk-pixbuf-2.22.1/config.sub with
/usr/share/gnuconfig/config.sub
./configure --prefix=/usr --build=i686-pc-linux-gnu
--host=i686-pc-linux-gnu --mandir=/usr/share/man
--infodir=/usr/share/info --datadir=/usr/share --sysconfdir=/etc
--localstatedir=/var/lib --disable-gtk-doc --with-libjpeg
--with-libjasper --with-libtiff --disable-introspection --with-x11
--with-libpng

checking for a BSD-compatible install... /usr/bin/install -c
checking whether build environment is sane... yes
checking for a thread-safe mkdir -p... /bin/mkdir -p
checking for gawk... gawk
checking whether make sets $(MAKE)... yes
checking whether to disable maintainer-specific portions of Makefiles... yes
checking for i686-pc-linux-gnu-gcc... gcc
checking whether the C compiler works... no
configure: error: in
`/var/tmp/portage/x11-libs/gdk-pixbuf-2.22.1/work/gdk-pixbuf-2.22.1':

configure: error: C compiler cannot create executables
See `config.log' for more details.

!!! Please attach the following file when seeking support:
!!!
/var/tmp/portage/x11-libs/gdk-pixbuf-2.22.1/work/gdk-pixbuf-2.22.1/config.log

* ERROR: x11-libs/gdk-pixbuf-2.22.1 failed (configure phase):
* econf failed
*
* Call stack:
* ebuild.sh, line 56: Called src_configure
* environment, line 2981: Called econf '--disable-gtk-doc'
'--with-libjpeg' '--with-libjasper' '--with-libtiff'
'--disable-introspection' '--with-x11' '--with-libpng'

* ebuild.sh, line 557: Called die
* The specific snippet of code:
* die "econf failed"


And here is another:

>>> Emerging (1 of 1) sys-apps/sandbox-2.4
* sandbox-2.4.tar.xz RMD160 SHA1 SHA256 size ;-)
... [ ok ]

* Package: sys-apps/sandbox-2.4
* Repository: gentoo
* Maintainer: sandbox@gentoo.org
* USE: consolekit elibc_glibc kernel_linux policykit
userland_GNU x86

* FEATURES: preserve-libs sandbox
>>> Unpacking source...
>>> Unpacking sandbox-2.4.tar.xz to
/var/tmp/portage/sys-apps/sandbox-2.4/work

unpack sandbox-2.4.tar.xz: file format not recognized. Ignoring.
>>> Source unpacked in /var/tmp/portage/sys-apps/sandbox-2.4/work
>>> Compiling source in
/var/tmp/portage/sys-apps/sandbox-2.4/work/sandbox-2.4 ...

* Configuring sandbox for ABI=default...
* econf: updating sandbox-2.4/config.guess with
/usr/share/gnuconfig/config.guess
* econf: updating sandbox-2.4/config.sub with
/usr/share/gnuconfig/config.sub
../sandbox-2.4//configure --prefix=/usr --build=i686-pc-linux-gnu
--host=i686-pc-linux-gnu --mandir=/usr/share/man
--infodir=/usr/share/info --datadir=/usr/share --sysconfdir=/etc
--localstatedir=/var/lib --libdir=/usr/lib

checking for a BSD-compatible install... /usr/bin/install -c
checking whether build environment is sane... yes
checking for a thread-safe mkdir -p... /bin/mkdir -p
checking for gawk... gawk
checking whether make sets $(MAKE)... yes
checking environment state... ok
checking for i686-pc-linux-gnu-gcc... i686-pc-linux-gnu-gcc
checking whether the C compiler works... no
configure: error: in
`/var/tmp/portage/sys-apps/sandbox-2.4/work/build-default':

configure: error: C compiler cannot create executables
See `config.log' for more details.

!!! Please attach the following file when seeking support:
!!! /var/tmp/portage/sys-apps/sandbox-2.4/work/build-default/config.log
* ERROR: sys-apps/sandbox-2.4 failed (compile phase):
* econf failed


That help any?

I did try disabling sandbox but got the same error. Even gcc won't
compile as you can see.


Ideas?

Dale

:-) :-)
 
Old 05-06-2011, 08:40 AM
Nikos Chantziaras
 
Default checking whether the C compiler works... no Oooops !!

On 05/06/2011 11:28 AM, Dale wrote:

Alan McKinnon wrote:

This is usually CFLAGS and other bits of env stuff. There's probably a
more
meaningful error earlier in the build log.

Can you post the full log for a failing file?



Here is one:


No, that's not it. It's this:

!!! Please attach the following file when seeking support:
!!! /var/tmp/portage/sys-apps/sandbox-2.4/work/build-default/config.log
 
Old 05-06-2011, 09:08 AM
Dale
 
Default checking whether the C compiler works... no Oooops !!

Nikos Chantziaras wrote:


No, that's not it. It's this:

!!! Please attach the following file when seeking support:
!!! /var/tmp/portage/sys-apps/sandbox-2.4/work/build-default/config.log




Hmmm. Thought it was the same. Here goes but it is lengthy:

root@smoker / # cat
/var/tmp/portage/sys-apps/sandbox-2.4/work/build-default/config.log

This file contains any messages produced by compilers while
running configure, to aid debugging if configure makes a mistake.

It was created by sandbox configure 2.4, which was
generated by GNU Autoconf 2.65. Invocation command line was

$ ../sandbox-2.4//configure --prefix=/usr --build=i686-pc-linux-gnu
--host=i686-pc-linux-gnu --mandir=/usr/share/man
--infodir=/usr/share/info --datadir=/usr/share --sysconfdir=/etc
--localstatedir=/var/lib --libdir=/usr/lib


## --------- ##
## Platform. ##
## --------- ##

hostname = smoker
uname -m = i686
uname -r = 2.6.36-gentoo-r5
uname -s = Linux
uname -v = #1 PREEMPT Mon Dec 27 05:46:37 CST 2010

/usr/bin/uname -p = AMD Athlon(tm) XP 2500+
/bin/uname -X = unknown

/bin/arch = unknown
/usr/bin/arch -k = unknown
/usr/convex/getsysinfo = unknown
/usr/bin/hostinfo = unknown
/bin/machine = unknown
/usr/bin/oslevel = unknown
/bin/universe = unknown

PATH: /usr/lib/portage/bin/ebuild-helpers
PATH: /usr/local/sbin
PATH: /usr/local/bin
PATH: /usr/sbin
PATH: /usr/bin
PATH: /sbin
PATH: /bin
PATH: /opt/bin
PATH: /usr/i686-pc-linux-gnu/gcc-bin/4.4.4


## ----------- ##
## Core tests. ##
## ----------- ##

configure:2399: checking for a BSD-compatible install
configure:2467: result: /usr/bin/install -c
configure:2478: checking whether build environment is sane
configure:2528: result: yes
configure:2669: checking for a thread-safe mkdir -p
configure:2708: result: /bin/mkdir -p
configure:2721: checking for gawk
configure:2737: found /usr/bin/gawk
configure:2748: result: gawk
configure:2759: checking whether make sets $(MAKE)
configure:2781: result: yes
configure:2896: checking environment state
PORTAGE_FEATURES=assume-digests binpkg-logs buildpkg distlocks
fixlafiles fixpackages news parallel-fetch preserve-libs protect-owned
sandbox sfperms strict unknown-features-warn unmerge-logs
unmerge-orphans userfetch

PVR=2.4
FETCHCOMMAND_SSH=bash -c "x=${2#ssh://} ; host=${x%%/*} ;
port=${host##*:} ; host=${host%:*} ; [[ ${host} = ${port} ]] &&
port=22 ; exec rsync --rsh="ssh -p${port}" -avP
"${host}:/${x#*/}" "$1"" rsync "${DISTDIR}/${FILE}" "${URI}"
KEYWORDS=alpha amd64 arm hppa ia64 m68k ~mips ppc ppc64 s390 sh sparc
x86 ~sparc-fbsd -x86-fbsd

A=sandbox-2.4.tar.xz
LDFLAGS=-Wl,-O1 -Wl,--as-needed
NUT_DRIVERS=cyberpower
SANE_BACKENDS=hp
ALSA_CARDS=
XTABLES_ADDONS=quota2 psd pknock lscan length2 ipv4options ipset ipp2p
iface geoip fuzzy condition tee tarpit sysrq steal rawnat logmark ipmark
dhcpmac delude chaos account

D=/var/tmp/portage/sys-apps/sandbox-2.4/image/
PORTAGE_IPC_DAEMON=1
SLOT=0
SANDBOX_WRITE=:/dev/console:/dev/fd:/dev/full:/dev/null:/dev/pts/:/dev/pty:/dev/shm:/dev/tts:/dev/tty:/dev/vc/:/dev/zero:/proc/self/fd:/tmp/:/usr/lib32/cf:/usr/lib32/conftest:/usr/lib64/cf:/usr/lib64/conftest:/usr/lib/cf:/usr/lib/conftest:/usr/tmp/cf:/usr/tmp/conftest:/var/tmp:/var/tmp/:/var/tmp/portage/sys-apps/sandbox-2.4/homedir/.bash_history
SANDBOX_LIB=libsandbox.so
ELIBC=glibc
LINGUAS=en_US en
SHELL=/bin/sh
TERM=screen
KERNEL=linux
KV=2.6.36-gentoo-r5
XDG_SESSION_COOKIE=d209e0650ffe67fde18419e94bf8e89 5-1304650290.725723-105440127
TMPDIR=/var/tmp/portage/sys-apps/sandbox-2.4/temp
CATEGORY=sys-apps
SSH_CLIENT=192.168.2.5 38142 22
CPPFLAGS=
PORT_ENOTICE_DIR=/var/tmp/portage/enotice/
FILESDIR=/usr/portage/sys-apps/sandbox/files
LD_PRELOAD=libsandbox.so
_E_DOCDESTTREE_=
EXEOPTIONS=-m0755
EBUILD_MASTER_PID=32719
ACCEPT_LICENSE=GPL-2
DESTTREE=/usr
SANDBOX_DEBUG=0
DUALCASE=1
DEFINED_PHASES= compile install postinst preinst test unpack
SSH_TTY=/dev/pts/0
SANDBOX_PREDICT=/var/tmp/portage/sys-apps/sandbox-2.4/homedir:/dev/crypto:/var/cache/fontconfig
PORTAGE_CONFIGROOT=/
LC_ALL=C
SANDBOX_PID=32638
ANT_HOME=/usr/share/ant
PROVIDE=
P=sandbox-2.4
ECLASSDIR=/usr/portage/eclass
_E_EXEDESTTREE_=
PORTAGE_ARCHLIST=ppc sparc64-freebsd ppc-openbsd x86-openbsd ppc64
x86-winnt x86-fbsd ppc-aix alpha arm x86-freebsd s390 amd64 arm-linux
x86-macos x64-openbsd ia64-hpux hppa x86-netbsd x86-cygwin amd64-linux
ia64-linux x86 sparc-solaris x64-freebsd sparc64-solaris x86-linux
x64-macos sparc m68k-mint ia64 mips ppc-macos x86-interix hppa-hpux
amd64-fbsd x64-solaris mips-irix m68k sh x86-solaris sparc-fbsd

PORTAGE_PYM_PATH=/usr/lib/portage/pym
http_proxy=http://192.168.2.5:8080
USE=consolekit elibc_glibc kernel_linux policykit userland_GNU x86
LS_COLORS=rs=0:di=01;34:ln=01;36:mh=00i=40;33:so =01;35:do=01;35:bd=40;33;01:cd=40;33;01r=01;05;3 7;41:mi=01;05;37;41:su=37;41:sg=30;43:ca=30;41:tw= 30;42w=34;42:st=37;44:ex=01;32:*.tar=01;31:*.tgz =01;31:*.arj=01;31:*.taz=01;31:*.lzh=01;31:*.lzma= 01;31:*.tlz=01;31:*.txz=01;31:*.zip=01;31:*.z=01;3 1:*.Z=01;31:*.dz=01;31:*.gz=01;31:*.lz=01;31:*.xz= 01;31:*.bz2=01;31:*.bz=01;31:*.tbz=01;31:*.tbz2=01 ;31:*.tz=01;31:*.deb=01;31:*.rpm=01;31:*.jar=01;31 :*.rar=01;31:*.ace=01;31:*.zoo=01;31:*.cpio=01;31: *.7z=01;31:*.rz=01;31:*.jpg=01;35:*.jpeg=01;35:*.g if=01;35:*.bmp=01;35:*.pbm=01;35:*.pgm=01;35:*.ppm =01;35:*.tga=01;35:*.xbm=01;35:*.xpm=01;35:*.tif=0 1;35:*.tiff=01;35:*.png=01;35:*.svg=01;35:*.svgz=0 1;35:*.mng=01;35:*.pcx=01;35:*.mov=01;35:*.mpg=01; 35:*.mpeg=01;35:*.m2v=01;35:*.mkv=01;35:*.ogm=01;3 5:*.mp4=01;35:*.m4v=01;35:*.mp4v=01;35:*.vob=01;35 :*.qt=01;35:*.nuv=01;35:*.wmv=01;35:*.asf=01;35:*. rm=01;35:*.rmvb=01;35:*.flc=01;35:*.avi=01;35:*.fl i=01;35:*.flv=01;35:*.gl=01;35:*.dl=01;35:*.xcf=01 ;35:*.xwd=01;35:*.yuv=01;35:*.cgm=01;35:*.emf=01;3 5:*.axv=01;35:*.anx=01;35:*.ogv=01;35:*.ogx=01;35: *.pdf=00;32:*.ps=00;32:*.txt=00;32:*.patch=00;32:* .diff=00;32:*.log=00;32:*.tex=00;32:*.doc=00;32:*. aac=00;36:*.au=00;36:*.flac=00;36:*.mid=00;36:*.mi di=00;36:*.mka=00;36:*.mp3=00;36:*.mpc=00;36:*.ogg =00;36:*.ra=00;36:*.wav=00;36:*.axa=00;36:*.oga=00 ;36:*.spx=00;36:*.xspf=00;36:
AA=sandbox-2.4.tar.xz
TEMP=/var/tmp/portage/sys-apps/sandbox-2.4/temp
PRELINK_PATH_MASK=/usr/lib/libfreebl3.so:/usr/lib/libnssdbm3.so:/usr/lib/libsoftokn3.so
S=/var/tmp/portage/sys-apps/sandbox-2.4/work/sandbox-2.4
GDK_USE_XFT=1
WORKDIR=/var/tmp/portage/sys-apps/sandbox-2.4/work
T=/var/tmp/portage/sys-apps/sandbox-2.4/temp
PORTAGE_BIN_PATH=/usr/lib/portage/bin
TERMCAP=SC|screen|VT 100/ANSI X3.64 virtual terminal:
O=E[%dB:LE=E[%dD:RI=E[%dC:UP=E[%dA:bs:bt=E[Z:
:cd=E[J:ce=E[K:cl=E[HE[J:cm=E[%i%d;%dH:ct=E[3g:
:do=^J:nd=E[Ct:rc=E8:rs=Ec:sc=E7:st=EH:up=EM:
:le=^H:bl=^G:cr=^M:it#8:ho=E[H:nw=EE:ta=^I:is=E)0:
:li#36:co#171:am:xn:xv:LP:sr=EM:al=E[L:AL=E[%dL:
:cs=E[%i%d;%dr:dl=E[ML=E[%dM:dc=E[PC=E[%dP:
:im=E[4h:ei=E[4l:mi:IC=E[%d@:ks=E[?1hE=:
:ke=E[?1lE>:vi=E[?25l:ve=E[34hE[?25h:vs=E[34l:
:ti=E[?1049h:te=E[?1049l:us=E[4m:ue=E[24m:so=E[3m:
:se=E[23m:mb=E[5m:md=E[1m:mr=E[7m:me=E[m:ms:
:Co#8a#64:AF=E[3%dm:AB=E[4%dmp=E[39;49m:AX:
:vb=Eg:G0:as=E(0:ae=E(B:

:ac=140140aaffggjjkkllmmnnooppqqrrssttuuvvwwxxyyzz {{||}}~~..--++,,hhII00:

o=E[5if=E[4i:Z0=E[?3h:Z1=E[?3l:k0=E[10~:
:k1=EOP:k2=EOQ:k3=EOR:k4=EOS:k5=E[15~:k6=E[17~:
:k7=E[18~:k8=E[19~:k9=E[20~:k;=E[21~:F1=E[23~:
:F2=E[24~:F3=E[1;2P:F4=E[1;2Q:F5=E[1;2R:F6=E[1;2S:
:F7=E[15;2~:F8=E[17;2~:F9=E[18;2~:FA=E[19;2~:kb=^H:
:K2=EOE:kB=E[Z:kF=E[1;2B:kR=E[1;2A:*4=E[3;2~:
:*7=E[1;2F:#2=E[1;2H:#3=E[2;2~:#4=E[1;2D:%c=E[6;2~:
:%e=E[5;2~:%i=E[1;2C:kh=E[1~:@1=E[1~:kH=E[4~:
:@7=E[4~:kN=E[6~:kP=E[5~:kI=E[2~:kD=E[3~:ku=EOA:
:kd=EOB:kr=EOC:kl=EOD:km:
PROFILE_PATHS=/usr/portage/profiles/base
/usr/portage/profiles/default/linux
/usr/portage/profiles/arch/base
/usr/portage/profiles/arch/x86
/usr/portage/profiles/default/linux/x86
/usr/portage/profiles/releases
/usr/portage/profiles/releases/10.0
/usr/portage/profiles/default/linux/x86/10.0
/usr/portage/profiles/targets/desktop
/usr/portage/profiles/default/linux/x86/10.0/desktop
/usr/portage/profiles/targets/desktop
/usr/portage/profiles/targets/desktop/kde
/usr/portage/profiles/default/linux/x86/10.0/desktop/kde
PROFILE_ONLY_VARIABLES=ARCH ELIBC KERNEL USERLAND
SANDBOX_DENY=
EAPI=0
SANDBOX_BASHRC=/usr/share/sandbox/sandbox.bashrc
PORTAGE_SANDBOX_COMPAT_LEVEL=22
CXXFLAGS=-march=native -O2 -pipe -fomit-frame-pointer
MAKEOPTS=-j2
RESTRICT=
PAGER=/usr/bin/less
PORTAGE_REPO_NAME=gentoo
VIDEO_CARDS=
PORTAGE_BZIP2_COMMAND=bzip2
PORTAGE_BASHRC=/etc/portage/bashrc
PM_EBUILD_HOOK_DIR=/etc/portage/env
FLTK_DOCDIR=/usr/share/doc/fltk-1.1.9-r2/html
XDG_CONFIG_DIRS=/etc/xdg
PORTAGE_BUILDDIR=/var/tmp/portage/sys-apps/sandbox-2.4
CAMERAS=canon ptp2
CROSSCOMPILE_OPTS=
INPUT_DEVICES=keyboard mouse evdev
LIBDIR_default=lib
PATH=/usr/lib/portage/bin/ebuild-helpers:/usr/local/sbin:/usr/local/bin:/usr/sbin:/usr/bin:/sbin:/bin:/opt/bin:/usr/i686-pc-linux-gnu/gcc-bin/4.4.4
STY=11474.emerge
SANDBOX_ACTIVE=armedandready
FCFLAGS=
NETBEANS=apisupport cnd groovy gsf harness ide identity j2ee java
mobility nb php profiler soa visualweb webcommon websvccommon xml

CCACHE_DISABLE=1
PORTAGE_NICENESS=5
PWD=/var/tmp/portage/sys-apps/sandbox-2.4/work/build-default
PORTAGE_TMPDIR=/var/tmp
ECLASS_DEPTH=0
CHOST=i686-pc-linux-gnu
PR=r0
JAVA_HOME=/etc/java-config-2/current-system-vm
PORTAGE_PYTHON=/usr/bin/python2.7
PKGDIR=/usr/portage/packages
PORTAGE_ACTUAL_DISTDIR=/usr/portage/distfiles
EDITOR=/bin/nano
SANDBOX_ON=1
CHOST_default=i686-pc-linux-gnu
JAVAC=/etc/java-config-2/current-system-vm/bin/javac
RESUMECOMMAND_SSH=bash -c "x=${2#ssh://} ; host=${x%%/*} ;
port=${host##*:} ; host=${host%:*} ; [[ ${host} = ${port} ]] &&
port=22 ; exec rsync --rsh="ssh -p${port}" -avP
"${host}:/${x#*/}" "$1"" rsync "${DISTDIR}/${FILE}" "${URI}"

LANG=en_US
PORTAGE_INST_GID=0
KERNEL_ABI=default
PV=2.4
SANDBOX_LOG=/var/log/sandbox/sandbox-32701.log
MULTILIB_ABIS=default
EBUILD_PHASE=compile
PORTAGE_GID=250
PORTAGE_IUSE=^(alpha|alsa\_cards\_aoa|alsa\_cards\ _aoa-fabric-layout|alsa\_cards\_aoa-onyx|alsa\_cards\_aoa-soundbus|alsa\_cards\_aoa-soundbus-i2s|alsa\_cards\_aoa-tas|alsa\_cards\_aoa-toonie|alsa\_cards\_armaaci|alsa\_cards\_at91-soc|alsa\_cards\_at91-soc-eti-b1-wm8731|alsa\_cards\_au1x00|alsa\_cards\_harmony|al sa\_cards\_powermac|alsa\_cards\_pxa2xx-i2sound|alsa\_cards\_pxa2xx-soc|alsa\_cards\_pxa2xx-soc-corgi|alsa\_cards\_pxa2xx-soc-poodle|alsa\_cards\_pxa2xx-soc-spitz|alsa\_cards\_pxa2xx-soc-tosa|alsa\_cards\_sa11xx-uda1341ts|alsa\_cards\_sun-amd7930|alsa\_cards\_sun-cs4231|alsa\_cards\_sun-dbri|altivec|amd64|amd64-fbsd|amd64-linux|aqua|arm|arm-linux|ayatana|bootstrap|build|consolekit|coreaudio |crosscompile\_opts\_.*|elibc\_AIX|elibc\_Darwin|e libc\_DragonFly|elibc\_FreeBSD|elibc\_HPUX|elibc\_ IRIX|elibc\_Interix|elibc\_NetBSD|elibc\_OpenBSD|e libc\_SunOS|elibc\_.*|elibc\_glibc|elibc\_mintlib| elibc\_uclibc|emul-linux-x86|fixed-point|gluon|hal|hppa|hppa-hpux|ia64|ia64-hpux|ia64-linux|ibm|introspection|kdeenablefinal|kdeprefix|k ernel\_AIX|kernel\_Darwin|kernel\_FreeBSD|kernel\_ HPUX|kernel\_IRIX|kernel\_Interix|kernel\_NetBSD|k ernel\_OpenBSD|kernel\_SunOS|kernel\_.*|kernel\_fr eemint|kernel\_linux|kqueue|m68k|m68k-mint|mips|mips-irix|multilib|n32|n64|neon|pam\_console|pbbuttonsd |php\_targets\_php5-4|policykit|ppc|ppc64|ppc-aix|ppc-macos|ppc-openbsd|ppcsha1|prefix|ps3|pvm|real|ruby\_targets\ _ruby19|s390|selinux|sh|sparc|sparc64-freebsd|sparc64-solaris|sparc-fbsd|sparc-solaris|test|uclibc|ultra1|userland\_BSD|userland\ _GNU|userland\_.*|video\_cards\_impact|video\_card s\_newport|video\_cards\_omapfb|video\_cards\_sunb w2|video\_cards\_suncg14|video\_cards\_suncg3|vide o\_cards\_suncg6|video\_cards\_sunffb|video\_cards \_sunleo|video\_cards\_suntcx|video\_cards\_voodoo |vis|win64|x64-freebsd|x64-macos|x64-openbsd|x64-solaris|x86|x86-cygwin|x86-fbsd|x86-freebsd|x86-interix|x86-linux|x86-macos|x86-netbsd|x86-openbsd|x86-solaris|x86-winnt)$
PORTDIR_OVERLAY=
PKGUSE=
XARGS=xargs -r
PROPERTIES=
PORTAGE_COLORMAP=GOOD=$'
WARN=$'
BAD=$'
HILITE=$'
BRACKET=$'
ROOT=/
INSDESTTREE=
LIBOPTIONS=-m0644
PYTHONDONTWRITEBYTECODE=1
PORTAGE_INST_UID=0
USERLAND=GNU
BUILD_PREFIX=/var/tmp/portage
ALSA_PCM_PLUGINS=adpcm alaw asym copy dmix dshare dsnoop empty extplug
file hooks iec958 ioplug ladspa lfloat linear meter mmap_emul mulaw
multi null plug rate route share shm softvol

PHP_TARGETS=
RUBY_TARGETS=
SANDBOX_READ=/:/var/tmp
MOPREFIX=sandbox
DEFAULT_ABI=default
SHLVL=3
PORTAGE_RESTRICT=
HOME=/var/tmp/portage/sys-apps/sandbox-2.4/homedir
JDK_HOME=/etc/java-config-2/current-system-vm
LANGUAGE=C
SANDBOX_DEBUG_LOG=/var/log/sandbox/sandbox-debug-32701.log
APACHE2_MODULES=
INHERITED= toolchain-funcs multilib portability eutils flag-o-matic
CFLAGS=-march=native -O2 -pipe -fomit-frame-pointer
JAVACC_HOME=/usr/share/javacc/
RSYNC_RETRIES=1
DIROPTIONS=-m0755
LICENSE=GPL-2
PKG_LOGDIR=/var/tmp/portage/sys-apps/sandbox-2.4/temp/logging
PORTAGE_LOG_FILE=/var/log/portage/elog/sys-apps:sandbox-2.4:20110506-073007.log


SANDBOX_VERBOSE=1
PORTAGE_COMPRESS_EXCLUDE_SUFFIXES=css gif htm[l]? jp[e]?g js pdf png
LOGNAME=root
LESS=-R -M --shift 5
TMP=/var/tmp/portage/sys-apps/sandbox-2.4/temp
WINDOW=0
CVS_RSH=ssh
GCC_SPECS=
as_nl=

ROOTPATH=/opt/bin:/usr/i686-pc-linux-gnu/gcc-bin/4.4.4
SSH_CONNECTION=192.168.2.5 38142 192.168.2.6 22
XDG_DATA_DIRS=/usr/local/share:/usr/share
CONF_PREFIX=/usr
PF=sandbox-2.4
EBUILD=/usr/portage/sys-apps/sandbox/sandbox-2.4.ebuild
LESSOPEN=|lesspipe.sh %s
PORTAGE_DEPCACHEDIR=/var/cache/edb/dep
ARCH=x86
RDEPEND=
R_HOME=/usr/lib/R
PORTAGE_SIGPIPE_STATUS=141
PKG_TMPDIR=/var/tmp/portage/._unmerge_
NOCOLOR=true
PORTAGE_DEBUG=0
PORTAGE_WORKDIR_MODE=0700
OPENGL_PROFILE=nvidia
USE_EXPAND=ALSA_CARDS ALSA_PCM_PLUGINS APACHE2_MODULES APACHE2_MPMS
CAMERAS COLLECTD_PLUGINS CROSSCOMPILE_OPTS DRACUT_MODULES DVB_CARDS
ELIBC FCDSL_CARDS FOO2ZJS_DEVICES FRITZCAPI_CARDS GPSD_PROTOCOLS
INPUT_DEVICES KERNEL LCD_DEVICES LINGUAS LIRC_DEVICES MISDN_CARDS
NETBEANS_MODULES NGINX_MODULES_HTTP NGINX_MODULES_MAIL PHP_TARGETS
QEMU_SOFTMMU_TARGETS QEMU_USER_TARGETS RUBY_TARGETS SANE_BACKENDS
USERLAND VIDEO_CARDS XFCE_PLUGINS XTABLES_ADDONS

DISTDIR=/var/tmp/portage/sys-apps/sandbox-2.4/distdir
FEATURES=assume-digests binpkg-logs buildpkg distlocks fixlafiles
fixpackages news parallel-fetch preserve-libs protect-owned sandbox
sfperms strict unknown-features-warn unmerge-logs unmerge-orphans userfetch

CBUILD=i686-pc-linux-gnu
LCD_DEVICES=
ECONF_SOURCE=../sandbox-2.4/
PORTDIR=/usr/portage
PN=sandbox
EMERGE_FROM=ebuild
INSOPTIONS=-m0644
CTARGET_default=i686-pc-linux-gnu
GPSD_PROTOCOLS=ashtech aivdm earthmate evermore fv18 garmin garmintxt
gpsclock itrax mtk3301 nmea ntrip navcom oceanserver oldstyle oncore
rtcm104v2 rtcm104v3 sirf superstar2 timing tsip tripmate tnt ubx

COLLECTD_PLUGINS=df interface irq load memory rrdtool swap syslog
FFLAGS=
_=/usr/bin/env
configure:2899: result: ok
configure:2910: checking for i686-pc-linux-gnu-gcc
configure:2926: found /usr/bin/i686-pc-linux-gnu-gcc
configure:2937: result: i686-pc-linux-gnu-gcc
configure:3206: checking for C compiler version
configure:3215: i686-pc-linux-gnu-gcc --version >&5
i686-pc-linux-gnu-gcc (Gentoo 4.4.4-r2 p1.2, pie-0.4.5) 4.4.4
Copyright (C) 2010 Free Software Foundation, Inc.
This is free software; see the source for copying conditions. There is NO
warranty; not even for MERCHANTABILITY or FITNESS FOR A PARTICULAR PURPOSE.

configure:3226: $? = 0
configure:3215: i686-pc-linux-gnu-gcc -v >&5
Using built-in specs.
Target: i686-pc-linux-gnu
Configured with:
/var/tmp/portage/sys-devel/gcc-4.4.4-r2/work/gcc-4.4.4/configure
--prefix=/usr --bindir=/usr/i686-pc-linux-gnu/gcc-bin/4.4.4
--includedir=/usr/lib/gcc/i686-pc-linux-gnu/4.4.4/include
--datadir=/usr/share/gcc-data/i686-pc-linux-gnu/4.4.4
--mandir=/usr/share/gcc-data/i686-pc-linux-gnu/4.4.4/man
--infodir=/usr/share/gcc-data/i686-pc-linux-gnu/4.4.4/info
--with-gxx-include-dir=/usr/lib/gcc/i686-pc-linux-gnu/4.4.4/include/g++-v4
--host=i686-pc-linux-gnu --build=i686-pc-linux-gnu --disable-altivec
--disable-fixed-point --without-ppl --without-cloog --enable-nls
--without-included-gettext --with-system-zlib --disable-werror
--enable-secureplt --disable-multilib --enable-libmudflap
--disable-libssp --enable-libgomp
--with-python-dir=/share/gcc-data/i686-pc-linux-gnu/4.4.4/python
--enable-checking=release --disable-libgcj --with-arch=i686
--enable-languages=c,c++,fortran --enable-shared --enable-threads=posix
--enable-__cxa_atexit --enable-clocale=gnu
--with-bugurl=http://bugs.gentoo.org/ --with-pkgversion='Gentoo 4.4.4-r2
p1.2, pie-0.4.5'

Thread model: posix
gcc version 4.4.4 (Gentoo 4.4.4-r2 p1.2, pie-0.4.5)
configure:3226: $? = 0
configure:3215: i686-pc-linux-gnu-gcc -V >&5
i686-pc-linux-gnu-gcc: '-V' option must have argument
configure:3226: $? = 1
configure:3215: i686-pc-linux-gnu-gcc -qversion >&5
i686-pc-linux-gnu-gcc: unrecognized option '-qversion'
i686-pc-linux-gnu-gcc: no input files
configure:3226: $? = 1
configure:3246: checking whether the C compiler works
configure:3268: i686-pc-linux-gnu-gcc -march=native -O2 -pipe
-fomit-frame-pointer -Wl,-O1 -Wl,--as-needed conftest.c >&5
/usr/libexec/gcc/i686-pc-linux-gnu/4.4.4/cc1: error while loading shared
libraries: libmpfr.so.1: cannot open shared object file: No such file or
directory

configure:3272: $? = 1
configure:3310: result: no
configure: failed program was:
| /* confdefs.h */
| #define PACKAGE_NAME "sandbox"
| #define PACKAGE_TARNAME "sandbox"
| #define PACKAGE_VERSION "2.4"
| #define PACKAGE_STRING "sandbox 2.4"
| #define PACKAGE_BUGREPORT "sandbox@gentoo.org"
| #define PACKAGE_URL ""
| #define PACKAGE "sandbox"
| #define VERSION "2.4"
| #define SANDBOX_CONFIGURE_OPTS "--prefix=/usr
--build=i686-pc-linux-gnu --host=i686-pc-linux-gnu
--mandir=/usr/share/man --infodir=/usr/share/info --datadir=/usr/share
--sysconfdir=/etc --localstatedir=/var/lib --libdir=/usr/lib
build_alias=i686-pc-linux-gnu host_alias=i686-pc-linux-gnu
CFLAGS=-march=native -O2 -pipe -fomit-frame-pointer LDFLAGS=-Wl,-O1
-Wl,--as-needed CPPFLAGS="

| /* end confdefs.h. */
|
| int
| main ()
| {
|
| ;
| return 0;
| }
configure:3315: error: in
`/var/tmp/portage/sys-apps/sandbox-2.4/work/build-default':

configure:3319: error: C compiler cannot create executables
See `config.log' for more details.

## ---------------- ##
## Cache variables. ##
## ---------------- ##

ac_cv_env_CC_set=
ac_cv_env_CC_value=
ac_cv_env_CFLAGS_set=set
ac_cv_env_CFLAGS_value='-march=native -O2 -pipe -fomit-frame-pointer'
ac_cv_env_CPPFLAGS_set=set
ac_cv_env_CPPFLAGS_value=
ac_cv_env_CPP_set=
ac_cv_env_CPP_value=
ac_cv_env_LDFLAGS_set=set
ac_cv_env_LDFLAGS_value='-Wl,-O1 -Wl,--as-needed'
ac_cv_env_LIBS_set=
ac_cv_env_LIBS_value=
ac_cv_env_build_alias_set=set
ac_cv_env_build_alias_value=i686-pc-linux-gnu
ac_cv_env_host_alias_set=set
ac_cv_env_host_alias_value=i686-pc-linux-gnu
ac_cv_env_target_alias_set=
ac_cv_env_target_alias_value=
ac_cv_path_install='/usr/bin/install -c'
ac_cv_path_mkdir=/bin/mkdir
ac_cv_prog_AWK=gawk
ac_cv_prog_CC=i686-pc-linux-gnu-gcc
ac_cv_prog_make_make_set=yes

## ----------------- ##
## Output variables. ##
## ----------------- ##

ACLOCAL='${SHELL}
/var/tmp/portage/sys-apps/sandbox-2.4/work/sandbox-2.4/missing --run
aclocal-1.11'

ALLOCA='
AMDEPBACKSLASH='
AMDEP_FALSE='
AMDEP_TRUE='
AMTAR='${SHELL}
/var/tmp/portage/sys-apps/sandbox-2.4/work/sandbox-2.4/missing --run tar'

AM_BACKSLASH='
AM_DEFAULT_VERBOSITY='0'
AR='
AUTOCONF='${SHELL}
/var/tmp/portage/sys-apps/sandbox-2.4/work/sandbox-2.4/missing --run
autoconf'
AUTOHEADER='${SHELL}
/var/tmp/portage/sys-apps/sandbox-2.4/work/sandbox-2.4/missing --run
autoheader'

AUTOM4TE='
AUTOMAKE='${SHELL}
/var/tmp/portage/sys-apps/sandbox-2.4/work/sandbox-2.4/missing --run
automake-1.11'

AWK='gawk'
CC='i686-pc-linux-gnu-gcc'
CCDEPMODE='
CFLAGS='-march=native -O2 -pipe -fomit-frame-pointer'
CFLAG_EXCEPTIONS='
CPP='
CPPFLAGS='
CYGPATH_W='echo'
DEFS='
DEPDIR='
DSYMUTIL='
DUMPBIN='
ECHO_C='
ECHO_N='-n'
ECHO_T='
EGREP='
EXEEXT='
FGREP='
GREP='
HAVE_LIBSIGSEGV_FALSE='
HAVE_LIBSIGSEGV_TRUE='
INSTALL_DATA='${INSTALL} -m 644'
INSTALL_PROGRAM='${INSTALL}'
INSTALL_SCRIPT='${INSTALL}'
INSTALL_STRIP_PROGRAM='$(install_sh) -c -s'
LD='
LDFLAGS='-Wl,-O1 -Wl,--as-needed'
LDFLAG_VER='
LIBC_PATH='
LIBDL='
LIBOBJS='
LIBS='
LIBTOOL='
LIPO='
LN_S='
LTLIBOBJS='
MAKEINFO='${SHELL}
/var/tmp/portage/sys-apps/sandbox-2.4/work/sandbox-2.4/missing --run
makeinfo'

MKDIR_P='/bin/mkdir -p'
NM='
NMEDIT='
OBJDUMP='
OBJEXT='
OTOOL64='
OTOOL='
PACKAGE='sandbox'
PACKAGE_BUGREPORT='sandbox@gentoo.org'
PACKAGE_NAME='sandbox'
PACKAGE_STRING='sandbox 2.4'
PACKAGE_TARNAME='sandbox'
PACKAGE_URL='
PACKAGE_VERSION='2.4'
PATH_SEPARATOR=':'
RANLIB='
READELF='
SANDBOX_DEFINES='
SB_SCHIZO_FALSE='
SB_SCHIZO_SETTINGS='
SB_SCHIZO_TRUE='
SED='
SET_MAKE='
SHELL='/bin/sh'
STRIP='
VERSION='2.4'
ac_ct_CC='
ac_ct_DUMPBIN='
am__EXEEXT_FALSE='
am__EXEEXT_TRUE='
am__fastdepCC_FALSE='
am__fastdepCC_TRUE='
am__include='
am__isrc=' -I$(srcdir)'
am__leading_dot='.'
am__quote='
am__tar='${AMTAR} chof - "$$tardir"'
am__untar='${AMTAR} xf -'
bindir='${exec_prefix}/bin'
build='i686-pc-linux-gnu'
build_alias='i686-pc-linux-gnu'
build_cpu='
build_os='
build_vendor='
datadir='/usr/share'
datarootdir='${prefix}/share'
docdir='${datarootdir}/doc/${PACKAGE_TARNAME}'
dvidir='${docdir}'
exec_prefix='NONE'
host='i686-pc-linux-gnu'
host_alias='i686-pc-linux-gnu'
host_cpu='
host_os='
host_vendor='
htmldir='${docdir}'
includedir='${prefix}/include'
infodir='/usr/share/info'
install_sh='${SHELL}
/var/tmp/portage/sys-apps/sandbox-2.4/work/sandbox-2.4/install-sh'

libdir='/usr/lib'
libexecdir='${exec_prefix}/libexec'
localedir='${datarootdir}/locale'
localstatedir='/var/lib'
mandir='/usr/share/man'
mkdir_p='/bin/mkdir -p'
oldincludedir='/usr/include'
pdfdir='${docdir}'
prefix='/usr'
program_transform_name='s,x,x,'
psdir='${docdir}'
sbindir='${exec_prefix}/sbin'
sharedstatedir='${prefix}/com'
sysconfdir='/etc'
target_alias='

## ----------- ##
## confdefs.h. ##
## ----------- ##

/* confdefs.h */
#define PACKAGE_NAME "sandbox"
#define PACKAGE_TARNAME "sandbox"
#define PACKAGE_VERSION "2.4"
#define PACKAGE_STRING "sandbox 2.4"
#define PACKAGE_BUGREPORT "sandbox@gentoo.org"
#define PACKAGE_URL ""
#define PACKAGE "sandbox"
#define VERSION "2.4"
#define SANDBOX_CONFIGURE_OPTS "--prefix=/usr --build=i686-pc-linux-gnu
--host=i686-pc-linux-gnu --mandir=/usr/share/man
--infodir=/usr/share/info --datadir=/usr/share --sysconfdir=/etc
--localstatedir=/var/lib --libdir=/usr/lib build_alias=i686-pc-linux-gnu
host_alias=i686-pc-linux-gnu CFLAGS=-march=native -O2 -pipe
-fomit-frame-pointer LDFLAGS=-Wl,-O1 -Wl,--as-needed CPPFLAGS="


configure: exit 77
root@smoker / #


That shed any light?

Dale

:-) :-)
 
Old 05-06-2011, 09:15 AM
justin
 
Default checking whether the C compiler works... no Oooops !!

On 06/05/11 11:08, Dale wrote:

>
> That shed any light?
>
> Dale
>
> :-) :-)
>
>


Yes it does

/usr/libexec/gcc/i686-pc-linux-gnu/4.4.4/cc1: error while loading shared
libraries: libmpfr.so.1: cannot open shared object file: No such file or
directory

you upgraded your mpfr. Now you have to rebuild your gcc as well.
 
Old 05-06-2011, 09:21 AM
Nikos Chantziaras
 
Default checking whether the C compiler works... no Oooops !!

On 05/06/2011 12:08 PM, Dale wrote:

Nikos Chantziaras wrote:


No, that's not it. It's this:

!!! Please attach the following file when seeking support:
!!! /var/tmp/portage/sys-apps/sandbox-2.4/work/build-default/config.log




Hmmm. Thought it was the same. Here goes but it is lengthy:

[...]

That shed any light?


Yep:

/usr/libexec/gcc/i686-pc-linux-gnu/4.4.4/cc1: error while loading shared
libraries: libmpfr.so.1: cannot open shared object file


Meaning, run revdep-rebuild
 
Old 05-06-2011, 09:23 AM
Dale
 
Default checking whether the C compiler works... no Oooops !!

justin wrote:

On 06/05/11 11:08, Dale wrote:



That shed any light?

Dale

:-) :-)





Yes it does

/usr/libexec/gcc/i686-pc-linux-gnu/4.4.4/cc1: error while loading shared
libraries: libmpfr.so.1: cannot open shared object file: No such file or
directory

you upgraded your mpfr. Now you have to rebuild your gcc as well.




It won't compile mpfr either. I get the same error. It appears that I
can't compile ANYTHING right now. This ain't good. O_O


Would doing this from a CD work or would I get the same error?

I'm going to look for a binary. It's been a while so I'm not sure what
was left on there. :/


Dale

:-) :-)
 
Old 05-06-2011, 09:24 AM
Alan McKinnon
 
Default checking whether the C compiler works... no Oooops !!

Apparently, though unproven, at 11:15 on Friday 06 May 2011, justin did opine
thusly:

> On 06/05/11 11:08, Dale wrote:
> > That shed any light?
> >
> > Dale
> >
> > :-) :-)
>
> Yes it does
>
> /usr/libexec/gcc/i686-pc-linux-gnu/4.4.4/cc1: error while loading shared
> libraries: libmpfr.so.1: cannot open shared object file: No such file or
> directory
>
> you upgraded your mpfr. Now you have to rebuild your gcc as well.

That's gonna be fun.

He doesn't have a working gcc to use to rebuild gcc.

--
alan dot mckinnon at gmail dot com
 
Old 05-06-2011, 09:40 AM
Dale
 
Default checking whether the C compiler works... no Oooops !!

Dale wrote:

justin wrote:

On 06/05/11 11:08, Dale wrote:


That shed any light?

Dale

:-) :-)




Yes it does

/usr/libexec/gcc/i686-pc-linux-gnu/4.4.4/cc1: error while loading shared
libraries: libmpfr.so.1: cannot open shared object file: No such file or
directory

you upgraded your mpfr. Now you have to rebuild your gcc as well.



It won't compile mpfr either. I get the same error. It appears that
I can't compile ANYTHING right now. This ain't good. O_O


Would doing this from a CD work or would I get the same error?

I'm going to look for a binary. It's been a while so I'm not sure
what was left on there. :/


Dale

:-) :-)



I found a binary for a older version. That seems to be working. I will
run all the usual suspects, revdep-rebuild, python-updater and such and
see what happens. Python-updater is making its list now. Still
scratching my head on that one.


Thanks for the help. Will post back if it gives any more problems.

Dale

:-) :-)
 
Old 05-06-2011, 09:41 AM
Dale
 
Default checking whether the C compiler works... no Oooops !!

Nikos Chantziaras wrote:

On 05/06/2011 12:08 PM, Dale wrote:

Nikos Chantziaras wrote:


No, that's not it. It's this:

!!! Please attach the following file when seeking support:
!!! /var/tmp/portage/sys-apps/sandbox-2.4/work/build-default/config.log




Hmmm. Thought it was the same. Here goes but it is lengthy:

[...]

That shed any light?


Yep:

/usr/libexec/gcc/i686-pc-linux-gnu/4.4.4/cc1: error while loading
shared libraries: libmpfr.so.1: cannot open shared object file


Meaning, run revdep-rebuild




On the list of things to do. Running python-updater now will run that
next.


Thanks.

Dale

:-) :-)
 

Thread Tools




All times are GMT. The time now is 02:57 AM.

VBulletin, Copyright ©2000 - 2014, Jelsoft Enterprises Ltd.
Content Relevant URLs by vBSEO ©2007, Crawlability, Inc.
Copyright 2007 - 2008, www.linux-archive.org