FAQ Search Today's Posts Mark Forums Read
» Video Reviews

» Linux Archive

Linux-archive is a website aiming to archive linux email lists and to make them easily accessible for linux users/developers.


» Sponsor

» Partners

» Sponsor

Go Back   Linux Archive > Gentoo > Gentoo User

 
 
LinkBack Thread Tools
 
Old 06-27-2010, 06:25 PM
Mark Knecht
 
Default emerge @preserved-rebuild failure...

Hi,
This is a mostly stable machine. Why is what I think is the stable
version of libgnomecanvas-python failing to build?

The newer version portage (2.28.1) requires masked packages so
that's not a good option.

What's a person to do?

Thanks,
Mark

c2stable ~ # eix libgnomecanvas-python
[i] dev-python/libgnomecanvas-python
Available versions: (2) 2.22.3!t 2.26.1!t 2.28.0!t ~2.28.1!t
{debug examples}
Installed versions: 2.28.0(2)!t(08:28:16 06/11/10)(-examples)
Homepage: http://pygtk.org/
Description: Python bindings for the Gnome Canvas library

c2stable ~ # emerge @preserved-rebuild
<SNIP>
>>> Failed to emerge dev-python/libgnomecanvas-python-2.28.0, Log file:

>>> '/var/tmp/portage/dev-python/libgnomecanvas-python-2.28.0/temp/build.log'

* Messages for package x11-libs/gtk+-2.18.9:

* Please install app-text/evince for print preview functionality.
* Alternatively, check "gtk-print-preview-command" documentation and
* add it to your gtkrc.

* Messages for package dev-python/libgnomecanvas-python-2.28.0:

* ERROR: dev-python/libgnomecanvas-python-2.28.0 failed:
* Building failed with CPython 2.6 in building() function
*
* Call stack:
* ebuild.sh, line 48: Called src_compile
* environment, line 5540: Called gnome-python-common_src_compile
* environment, line 3132: Called python_execute_function '-s' 'building'
* environment, line 4305: Called die
* The specific snippet of code:
* die "${failure_message}";
*
* If you need support, post the output of 'emerge --info
=dev-python/libgnomecanvas-python-2.28.0',
* the complete build log and the output of 'emerge -pqv
=dev-python/libgnomecanvas-python-2.28.0'.
* The complete build log is located at
'/var/tmp/portage/dev-python/libgnomecanvas-python-2.28.0/temp/build.log'.
* The ebuild environment file is located at
'/var/tmp/portage/dev-python/libgnomecanvas-python-2.28.0/temp/environment'.
* S: '/var/tmp/portage/dev-python/libgnomecanvas-python-2.28.0/work/gnome-python-2.28.0'

* GNU info directory index is up-to-date.

!!! existing preserved libs:
>>> package: media-libs/libpng-1.4.3
* - /usr/lib64/libpng12.so
* - /usr/lib64/libpng12.so.0
* - /usr/lib64/libpng12.so.0.43.0
* used by
/opt/icedtea6-bin-1.8.0/jre/lib/amd64/libsplashscreen.so
(dev-java/icedtea6-bin-1.8.0)
* used by /usr/bin/annotate (media-libs/gd-2.0.35-r1)
* used by /usr/bin/baobab (gnome-extra/gnome-utils-2.28.3)
* used by 406 other files
Use emerge @preserved-rebuild to rebuild packages using these libraries
c2stable ~ #


c2stable ~ # emerge -1pv libgnomecanvas-python

These are the packages that would be merged, in order:

Calculating dependencies... done!
[ebuild R ] dev-python/libgnomecanvas-python-2.28.0 USE="-examples" 0 kB

Total: 1 package (1 reinstall), Size of downloads: 0 kB
c2stable ~ #


c2stable ~ # emerge --info
Portage 2.2_rc67 (default/linux/amd64/10.0, gcc-4.4.3,
glibc-2.11.2-r0, 2.6.34-gentoo x86_64)
================================================== ===============
System uname: Linux-2.6.34-gentoo-x86_64-Intel-R-_Core-TM-_i7_CPU_X_980_@_3.33GHz-with-gentoo-1.12.13
Timestamp of tree: Sun, 27 Jun 2010 16:45:01 +0000
app-shells/bash: 4.0_p37
dev-java/java-config: 2.1.10
dev-lang/python: 2.6.5-r2, 3.1.2-r3
dev-util/cmake: 2.6.4-r3
sys-apps/baselayout: 1.12.13
sys-apps/sandbox: 2.2
sys-devel/autoconf: 2.13, 2.65
sys-devel/automake: 1.8.5-r4, 1.9.6-r3, 1.10.3, 1.11.1
sys-devel/binutils: 2.20.1-r1
sys-devel/gcc: 4.4.3-r2
sys-devel/gcc-config: 1.4.1
sys-devel/libtool: 2.2.6b
virtual/os-headers: 2.6.30-r1
ACCEPT_KEYWORDS="amd64"
ACCEPT_LICENSE="* -@EULA dlj-1.1 PUEL AdobeFlash-10.1"
CBUILD="x86_64-pc-linux-gnu"
CFLAGS="-O2 -march=native -pipe"
CHOST="x86_64-pc-linux-gnu"
CONFIG_PROTECT="/etc /usr/share/X11/xkb /usr/share/config"
CONFIG_PROTECT_MASK="/etc/ca-certificates.conf /etc/env.d
/etc/env.d/java/ /etc/fonts/fonts.conf /etc/gconf /etc/revdep-rebuild
/etc/sandbox.d /etc/terminfo /etc/texmf/language.dat.d
/etc/texmf/language.def.d /etc/texmf/updmap.d /etc/texmf/web2c"
CXXFLAGS="-O2 -march=native -pipe"
DISTDIR="/usr/portage/distfiles"
EMERGE_DEFAULT_OPTS="--with-bdeps y"
FEATURES="assume-digests distlocks fixpackages news parallel-fetch
preserve-libs protect-owned sandbox sfperms strict unmerge-logs
unmerge-orphans userfetch"
GENTOO_MIRRORS="http://gentoo.osuosl.org/ "
LDFLAGS="-Wl,-O1"
LINGUAS="en"
MAKEOPTS="-j13"
PKGDIR="/usr/portage/packages"
PORTAGE_CONFIGROOT="/"
PORTAGE_RSYNC_OPTS="--recursive --links --safe-links --perms --times
--compress --force --whole-file --delete --stats --timeout=180
--exclude=/distfiles --exclude=/local --exclude=/packages"
PORTAGE_TMPDIR="/var/tmp"
PORTDIR="/usr/portage"
PORTDIR_OVERLAY="/var/lib/layman/pentoo"
SYNC="rsync://rsync.namerica.gentoo.org/gentoo-portage"
USE="X acl amd64 berkdb bzip2 cli cracklib crypt cxx dbus dri fortran
gdbm gnome gpm gstreamer iconv kde mmx modules mudflap multilib
ncurses nls nptl nptlonly openmp pam pcre perl pngi policykit pppd
python qt3support qt4 readline reflection session spl sse sse2 ssl
sysfs tcpd unicode xorg zlib" ALSA_CARDS="intel-hda hda-intel"
ALSA_PCM_PLUGINS="adpcm alaw asym copy dmix dshare dsnoop empty
extplug file hooks iec958 ioplug ladspa lfloat linear meter mmap_emul
mulaw multi null plug rate route share shm softvol"
APACHE2_MODULES="actions alias auth_basic authn_alias authn_anon
authn_dbm authn_default authn_file authz_dbm authz_default
authz_groupfile authz_host authz_owner authz_user autoindex cache dav
dav_fs dav_lock deflate dir disk_cache env expires ext_filter
file_cache filter headers include info log_config logio mem_cache mime
mime_magic negotiation rewrite setenvif speling status unique_id
userdir usertrack vhost_alias" ELIBC="glibc" INPUT_DEVICES="evdev
mouse keyboard" KERNEL="linux" LCD_DEVICES="bayrad cfontz cfontz633
glk hd44780 lb216 lcdm001 mtxorb ncurses text" LINGUAS="en"
RUBY_TARGETS="ruby18" USERLAND="GNU" VIDEO_CARDS="radeon fbdev vmware"
XTABLES_ADDONS="quota2 psd pknock lscan length2 ipv4options ipset
ipp2p iface geoip fuzzy condition tee tarpit sysrq steal rawnat
logmark ipmark dhcpmac delude chaos account"
Unset: CPPFLAGS, CTARGET, FFLAGS, INSTALL_MASK, LANG, LC_ALL,
PORTAGE_COMPRESS, PORTAGE_COMPRESS_FLAGS, PORTAGE_RSYNC_EXTRA_OPTS

c2stable ~ #
 
Old 06-27-2010, 06:41 PM
Alan McKinnon
 
Default emerge @preserved-rebuild failure...

On Sunday 27 June 2010 20:25:03 Mark Knecht wrote:
> Hi,
> This is a mostly stable machine. Why is what I think is the stable
> version of libgnomecanvas-python failing to build?
>
> The newer version portage (2.28.1) requires masked packages so
> that's not a good option.
>
> What's a person to do?
>
> Thanks,
> Mark
>
> c2stable ~ # eix libgnomecanvas-python
> [i] dev-python/libgnomecanvas-python
> Available versions: (2) 2.22.3!t 2.26.1!t 2.28.0!t ~2.28.1!t
> {debug examples}
> Installed versions: 2.28.0(2)!t(08:28:16 06/11/10)(-examples)
> Homepage: http://pygtk.org/
> Description: Python bindings for the Gnome Canvas library
>
> c2stable ~ # emerge @preserved-rebuild
> <SNIP>
>
> >>> Failed to emerge dev-python/libgnomecanvas-python-2.28.0, Log file:

The build error is before this. Please post that.

Everything below is various elogs to tell you that an error occured, not what
it is.



--
alan dot mckinnon at gmail dot com
 
Old 06-27-2010, 07:42 PM
Mark Knecht
 
Default emerge @preserved-rebuild failure...

On Sun, Jun 27, 2010 at 11:41 AM, Alan McKinnon <alan.mckinnon@gmail.com> wrote:
> On Sunday 27 June 2010 20:25:03 Mark Knecht wrote:
>> Hi,
>> * *This is a mostly stable machine. Why is what I think is the stable
>> version of libgnomecanvas-python failing to build?
>>
>> * *The newer version portage (2.28.1) requires masked packages so
>> that's not a good option.
>>
>> * *What's a person to do?
>>
>> Thanks,
>> Mark
>>
>> c2stable ~ # eix libgnomecanvas-python
>> [i] dev-python/libgnomecanvas-python
>> * * *Available versions: *(2) 2.22.3!t 2.26.1!t 2.28.0!t ~2.28.1!t
>> * * * * {debug examples}
>> * * *Installed versions: *2.28.0(2)!t(08:28:16 06/11/10)(-examples)
>> * * *Homepage: * * * * * *http://pygtk.org/
>> * * *Description: * * * * Python bindings for the Gnome Canvas library
>>
>> c2stable ~ # emerge @preserved-rebuild
>> <SNIP>
>>
>> >>> Failed to emerge dev-python/libgnomecanvas-python-2.28.0, Log file:
>
> The build error is before this. Please post that.
>
> Everything below is various elogs to tell you that an error occured, not what
> it is.
>
>
>
> --
> alan dot mckinnon at gmail dot com
>

Yeah, should have posted more. Sorry.

Hopefully this will get you far enough back to take a guess. Seems
that libpng12.la doesn't exist and indeed that file isn't there.

c2stable ~ # updatedb
c2stable ~ # slocate libpng12
/opt/vmware/workstation/lib/vmware-installer/1.1/lib/lib/libpng12.so.0
/opt/vmware/workstation/lib/vmware-installer/1.1/lib/lib/libpng12.so.0/libpng12.so.0
/opt/vmware/workstation/lib/vmware/lib/libpng12.so.0
/opt/vmware/workstation/lib/vmware/lib/libpng12.so.0/libpng12.so.0
/usr/lib32/libpng12.so.0
/usr/lib64/libpng12.so.0
/usr/lib64/libpng12.so
/usr/lib64/libpng12.so.0.43.0
c2stable ~ #

Thanks,
Mark

mv -f .deps/gtkunixprint_la-gtkunixprint.Tpo
.deps/gtkunixprint_la-gtkunixprint.Plo
/bin/sh ../libtool --tag=CC --mode=link x86_64-pc-linux-gnu-gcc
-I/usr/include/pycairo -I/usr/include/cairo -I/usr/include/pixman-1
-I/usr/include/freetype2 -I/usr/include/libpng14
-I/usr/include/gtk-unix-print-2.0 -I/usr/include/gtk-2.0
-I/usr/include/atk-1.0 -I/usr/include/cairo -I/usr/include/pango-1.0
-I/usr/lib64/gtk-2.0/include -I/usr/include/glib-2.0
-I/usr/lib64/glib-2.0/include -I/usr/include/pixman-1
-I/usr/include/freetype2 -I/usr/include/libpng14 -O2 -march=native
-pipe -Wall -fno-strict-aliasing -std=c9x -module -avoid-version
-export-symbols-regex initgtkunixprint -Wl,-O1 -o gtkunixprint.la
-rpath /usr/lib64/python2.6/site-packages/gtk-2.0
gtkunixprint_la-gtkunixprintmodule.lo gtkunixprint_la-gtkunixprint.lo
-lgtk-x11-2.0 -lgdk-x11-2.0 -latk-1.0 -lgio-2.0 -lpangoft2-1.0
-lgdk_pixbuf-2.0 -lpangocairo-1.0 -lcairo -lpango-1.0 -lfreetype
-lfontconfig -lgobject-2.0 -lgmodule-2.0 -lglib-2.0
/bin/grep: /usr/lib64/libpng12.la: No such file or directory
/bin/sed: can't read /usr/lib64/libpng12.la: No such file or directory
libtool: link: `/usr/lib64/libpng12.la' is not a valid libtool archive
make[2]: *** [glade.la] Error 1
make[2]: *** Waiting for unfinished jobs....
libtool: link: /usr/bin/nm -B
.libs/gtkunixprint_la-gtkunixprintmodule.o
.libs/gtkunixprint_la-gtkunixprint.o | sed -n -e 's/^.*[
]([ABCDGIRSTW][ABCDGIRSTW]*)[ ][
]*([_A-Za-z][_A-Za-z0-9]*)$/1 2 2/p' | /bin/sed 's/.* //' | sort
| uniq > .libs/gtkunixprint.exp
libtool: link: /bin/grep -E -e "initgtkunixprint"
".libs/gtkunixprint.exp" > ".libs/gtkunixprint.expT"
libtool: link: mv -f ".libs/gtkunixprint.expT" ".libs/gtkunixprint.exp"
libtool: link: echo "{ global:" > .libs/gtkunixprint.ver
libtool: link: cat .libs/gtkunixprint.exp | sed -e "s/(.*)/1;/" >>
.libs/gtkunixprint.ver
libtool: link: echo "local: *; };" >> .libs/gtkunixprint.ver
libtool: link: x86_64-pc-linux-gnu-gcc -shared
.libs/gtkunixprint_la-gtkunixprintmodule.o
.libs/gtkunixprint_la-gtkunixprint.o /usr/lib64/libgtk-x11-2.0.so
/usr/lib64/libgdk-x11-2.0.so /usr/lib64/libatk-1.0.so -L/usr/lib64
/usr/lib64/libgdk_pixbuf-2.0.so /usr/lib64/libgio-2.0.so -lresolv
/usr/lib64/libpangocairo-1.0.so /usr/lib64/libpangoft2-1.0.so
/usr/lib64/libcairo.so /usr/lib64/libpixman-1.so
/usr/lib64/libpng14.so /usr/lib64/libXrender.so /usr/lib64/libX11.so
/usr/lib64/libxcb.so /usr/lib64/libXau.so /usr/lib64/libXdmcp.so
/usr/lib64/libpango-1.0.so -lm /usr/lib64/libfontconfig.so
/usr/lib64/libfreetype.so -lz /usr/lib64/libexpat.so
/usr/lib64/libgobject-2.0.so /usr/lib64/libgmodule-2.0.so -ldl
/usr/lib64/libglib-2.0.so -march=native -Wl,-O1 -Wl,-soname
-Wl,gtkunixprint.so -Wl,-version-script -Wl,.libs/gtkunixprint.ver -o
.libs/gtkunixprint.so
Could not write method GtkPaperSize.to_key_file: No ArgType for GKeyFile*
Could not write method GtkWidget.style_get: varargs functions not supported
Could not write virtual accessor method
GtkWidget.dispatch_child_properties_changed: No ArgType for
GParamSpec**
Could not write virtual accessor method GtkWidget.child_notify: No
ArgType for GParamSpec*
Could not write virtual proxy
GtkWidget.dispatch_child_properties_changed: No ArgType for
GParamSpec**
Could not write virtual proxy GtkWidget.child_notify: No ArgType for GParamSpec*
Could not write virtual proxy GtkContainer.child_type: No ArgType for GType
Could not write method GtkAccelGroup.activate: No ArgType for GQuark
Could not write method GtkAccelGroup.find: No ArgType for GtkAccelKey*
Could not write method GtkAccelGroup.query: No ArgType for guint*
libtool: link: ( cd ".libs" && rm -f "gtkunixprint.la" && ln -s
"../gtkunixprint.la" "gtkunixprint.la" )
Could not write method GtkActionGroup.set_translate_func: No ArgType
for GtkTranslateFunc
Could not write method GtkCalendar.set_detail_func: No ArgType for
GtkCalendarDetailFunc
Could not write virtual accessor method
GtkMenuItem.toggle_size_request: No ArgType for gint*
Warning: generating old-style constructor for:gtk_clipboard_get_for_display
Could not write method GtkClipboard.wait_for_uris: No ArgType for gchar**
Could not write method GtkClipboard.request_uris: No ArgType for
GtkClipboardURIReceivedFunc
Could not write virtual accessor method GtkCList.selection_find: No
ArgType for GList*
Could not write virtual accessor method GtkCList.draw_row: No ArgType
for GtkCListRow*
Could not write virtual accessor method GtkCList.draw_drag_highlight:
No ArgType for GtkCListRow*
Could not write virtual accessor method GtkCList.insert_row: No
ArgType for gchar*[]
Could not write virtual accessor method GtkCList.set_cell_contents: No
ArgType for GtkCListRow*
Could not write virtual accessor method GtkCList.cell_size_request: No
ArgType for GtkCListRow*
Could not write virtual proxy GtkCList.selection_find: No ArgType for GList*
Could not write virtual proxy GtkCList.draw_row: No ArgType for GtkCListRow*
Could not write virtual proxy GtkCList.draw_drag_highlight: No ArgType
for GtkCListRow*
Could not write virtual proxy GtkCList.insert_row: No ArgType for gchar*[]
Could not write virtual proxy GtkCList.set_cell_contents: No ArgType
for GtkCListRow*
Could not write virtual proxy GtkCList.cell_size_request: No ArgType
for GtkCListRow*
Could not write method GtkCTree.set_drag_compare_func: No ArgType for
GtkCTreeCompareDragFunc
Could not write virtual proxy GtkCTree.tree_select_row: No ArgType for
GtkCTreeNode*
Could not write virtual proxy GtkCTree.tree_unselect_row: No ArgType
for GtkCTreeNode*
Could not write virtual proxy GtkCTree.tree_expand: No ArgType for GtkCTreeNode*
Could not write virtual proxy GtkCTree.tree_collapse: No ArgType for
GtkCTreeNode*
Could not write virtual proxy GtkCTree.tree_move: No ArgType for GtkCTreeNode*
Could not write virtual accessor method GtkScale.get_layout_offsets:
No ArgType for gint*
Could not write virtual proxy GtkScale.get_layout_offsets: cannot use
int* parameter with direction 'None'
Could not write method GtkImage.get_gicon: No ArgType for GIcon**
Could not write virtual accessor method
GtkIMContext.get_preedit_string: No ArgType for gchar**
Could not write virtual accessor method GtkIMContext.get_surrounding:
No ArgType for gchar**
Could not write virtual proxy GtkIMContext.get_preedit_string: No
ArgType for gchar**
Could not write virtual proxy GtkIMContext.get_surrounding: No ArgType
for gchar**
Could not write method GtkIMContextSimple.add_table: No ArgType for guint16*
Warning: generating old-style constructor for:gtk_item_factory_new
Could not write method GtkListStore.set_valuesv: No ArgType for gint*
Could not write method GtkNotebook.set_group: No ArgType for gpointer
Could not write method GtkNotebook.get_group: No ArgType for gpointer
Could not write virtual accessor method GtkNotebook.switch_page: No
ArgType for GtkNotebookPage*
Could not write virtual proxy GtkNotebook.switch_page: No ArgType for
GtkNotebookPage*
Warning: generating old-style constructor for:gtk_preview_new
Could not write virtual accessor method GtkRcStyle.parse: No ArgType
for GScanner*
Could not write virtual proxy GtkRcStyle.parse: No ArgType for GScanner*
Could not write method GtkSettings.set_property_value: No ArgType for
const-GtkSettingsValue*
Could not write virtual accessor method GtkSpinButton.input: No
ArgType for gdouble*
Could not write method GtkStyle.get_style_property: No ArgType for GValue*
Could not write method GtkStyle.get_valist: No ArgType for va_list
Could not write method GtkStyle.get: varargs functions not supported
Could not write virtual accessor method GtkStyle.draw_polygon: No
ArgType for GdkPoint*
Could not write virtual proxy GtkStyle.draw_polygon: No ArgType for GdkPoint*
Could not write method GtkTreeSelection.get_user_data: No ArgType for gpointer
Could not write method GtkTreeSelection.get_select_function: No
ArgType for GtkTreeSelectionFunc
Could not write method GtkTreeStore.set_valuesv: No ArgType for gint*
Could not write method GtkTreeView.set_destroy_count_func: No ArgType
for GtkTreeDestroyCountFunc
Could not write method GtkWindowGroup.list_windows: No ArgType for GList*
Could not write method GtkPageSetup.to_key_file: No ArgType for GKeyFile*
Could not write method GtkPageSetup.load_key_file: No ArgType for GKeyFile*
Could not write method GtkPrintSettings.to_key_file: No ArgType for GKeyFile*
Could not write method GtkPrintSettings.load_key_file: No ArgType for GKeyFile*
Could not write virtual proxy GtkStatusIcon.popup_menu: No ArgType for guint32
Could not write method GtkBuilder.connect_signals_full: No ArgType for
GtkBuilderConnectFunc
Could not write method GtkBuilder.value_from_string: No ArgType for GParamSpec*
Could not write method GtkBuilder.value_from_string_type: No ArgType for GValue*
Could not write virtual proxy GtkBuilder.get_type_from_name: No
ArgType for GType
Warning: generating old-style constructor for:gtk_recent_action_new
Could not write virtual accessor method
GtkCellLayout.set_cell_data_func: No ArgType for GtkCellLayoutDataFunc
Could not write method GtkFileChooser.get_files: No ArgType for GSList*
Could not write virtual accessor method GtkTreeModel.rows_reordered:
No ArgType for gint*
Could not write virtual accessor method GtkTreeModel.get_value: No
ArgType for GValue*
Could not write interface proxy GtkTreeModel.rows_reordered: cannot
use int* parameter with direction 'None'
Could not write interface proxy GtkTreeModel.get_column_type: No
ArgType for GType
Could not write interface proxy GtkTreeModel.get_value: No ArgType for GValue*
Could not write virtual accessor method
GtkTreeSortable.get_sort_column_id: No ArgType for gint*
Could not write virtual accessor method GtkTreeSortable.set_sort_func:
No ArgType for GtkTreeIterCompareFunc
Could not write virtual accessor method
GtkTreeSortable.set_default_sort_func: No ArgType for
GtkTreeIterCompareFunc
Could not write interface proxy GtkTreeSortable.get_sort_column_id:
cannot use int* parameter with direction 'None'
Could not write interface proxy GtkTreeSortable.set_sort_func: No
ArgType for GtkTreeIterCompareFunc
Could not write interface proxy GtkTreeSortable.set_default_sort_func:
No ArgType for GtkTreeIterCompareFunc
Could not write virtual accessor method GtkRecentChooser.get_items: No
ArgType for GList*
Could not write virtual accessor method GtkRecentChooser.list_filters:
No ArgType for GSList*
Could not write virtual accessor method
GtkRecentChooser.set_sort_func: No ArgType for GtkRecentSortFunc
Could not write interface proxy GtkRecentChooser.get_items: No ArgType
for GList*
Could not write interface proxy GtkRecentChooser.list_filters: No
ArgType for GSList*
Could not write interface proxy GtkRecentChooser.set_sort_func: No
ArgType for GtkRecentSortFunc
Could not write method GtkBuildable.set_buildable_property: No ArgType
for const-GValue*
Could not write method GtkBuildable.custom_tag_start: No ArgType for
GMarkupParser*
Could not write method GtkBuildable.custom_tag_end: No ArgType for gpointer*
Could not write method GtkBuildable.custom_finished: No ArgType for gpointer
Could not write virtual accessor method GtkBuildable.get_name: No
ArgType for constgchar*
Could not write virtual accessor method
GtkBuildable.set_buildable_property: No ArgType for const-GValue*
Could not write virtual accessor method GtkBuildable.custom_tag_start:
No ArgType for GMarkupParser*
Could not write virtual accessor method GtkBuildable.custom_tag_end:
No ArgType for gpointer*
Could not write virtual accessor method GtkBuildable.custom_finished:
No ArgType for gpointer
Could not write interface proxy GtkBuildable.get_name: No ArgType for
constgchar*
Could not write interface proxy GtkBuildable.set_buildable_property:
No ArgType for const-GValue*
Could not write interface proxy GtkBuildable.custom_tag_start: No
ArgType for GMarkupParser*
Could not write interface proxy GtkBuildable.custom_tag_end: No
ArgType for gpointer*
Could not write interface proxy GtkBuildable.custom_finished: No
ArgType for gpointer
Could not write function accel_map_load_scanner: No ArgType for GScanner*
Could not write function binding_entry_clear: No ArgType for GtkBindingSet*
Could not write function binding_entry_add_signall: No ArgType for
GtkBindingSet*
Could not write function binding_parse_binding: No ArgType for GScanner*
Could not write function color_selection_set_change_palette_hook: No
ArgType for GtkColorSelectionChangePaletteFunc
Could not write function
color_selection_set_change_palette_with_screen_hoo k: No ArgType for
GtkColorSelectionChangePaletteWithScreenFunc
Could not write function file_paths_sort: No ArgType for GSList*
Could not write function item_factory_popup_data_from_widget: No
ArgType for gpointer
Could not write function init_add: No ArgType for GtkFunction
Could not write function parse_args: No ArgType for int*
Could not write function init_with_args: No ArgType for int*
Could not write function get_option_group: No ArgType for GOptionGroup*
Could not write function settings_install_property: No ArgType for GParamSpec*
Could not write function settings_install_property_parser: No ArgType
for GParamSpec*
Could not write function stock_add_static: No ArgType for const-GtkStockItem*
Could not write function stock_set_translate_func: No ArgType for
GtkTranslateFunc
Could not write function print_run_page_setup_dialog_async: No ArgType
for GtkPageSetupDoneFunc
Could not write function builder_error_quark: No ArgType for GQuark
Could not write function page_setup_new_from_key_file: No ArgType for GKeyFile*
Could not write function paper_size_get_paper_sizes: No ArgType for GList*
Could not write function paper_size_new_from_key_file: No ArgType for GKeyFile*
Could not write function print_settings_new_from_key_file: No ArgType
for GKeyFile*
Could not write function rc_parse_color_full: No ArgType for GScanner*
Warning: Constructor for GtkAccessible needs to be updated to new API
See http://live.gnome.org/PyGTK_2fWhatsNew28#update-constructors
Warning: Constructor for GtkClipboard needs to be updated to new API
See http://live.gnome.org/PyGTK_2fWhatsNew28#update-constructors
Warning: Constructor for GtkItemFactory needs to be updated to new API
See http://live.gnome.org/PyGTK_2fWhatsNew28#update-constructors
Warning: Constructor for GtkPreview needs to be updated to new API
See http://live.gnome.org/PyGTK_2fWhatsNew28#update-constructors
Warning: Constructor for GtkListItem needs to be updated to new API
See http://live.gnome.org/PyGTK_2fWhatsNew28#update-constructors
Warning: Constructor for GtkCList needs to be updated to new API
See http://live.gnome.org/PyGTK_2fWhatsNew28#update-constructors
Warning: Constructor for GtkCTree needs to be updated to new API
See http://live.gnome.org/PyGTK_2fWhatsNew28#update-constructors
Warning: Constructor for GtkMessageDialog needs to be updated to new API
See http://live.gnome.org/PyGTK_2fWhatsNew28#update-constructors
Warning: Constructor for GtkRecentAction needs to be updated to new API
See http://live.gnome.org/PyGTK_2fWhatsNew28#update-constructors
***INFO*** The coverage of global functions is 88.67% (180/203)
***INFO*** The coverage of methods is 98.58% (2496/2532)
***INFO*** The coverage of virtual proxies is 94.67% (391/413)
***INFO*** The coverage of virtual accessors is 93.99% (469/499)
***INFO*** The coverage of interface proxies is 83.72% (72/86)
mv -f .deps/_gtk_la-gdk.Tpo .deps/_gtk_la-gdk.Plo
make[2]: Leaving directory
`/var/tmp/portage/dev-python/pygtk-2.16.0-r1/work/pygtk-2.16.0-2.6/gtk'
make[1]: *** [all-recursive] Error 1
make[1]: Leaving directory
`/var/tmp/portage/dev-python/pygtk-2.16.0-r1/work/pygtk-2.16.0-2.6'
make: *** [all] Error 2
* ERROR: dev-python/pygtk-2.16.0-r1 failed:
* Building failed with CPython 2.6 in python_default_function() function
*
* Call stack:
* ebuild.sh, line 48: Called src_compile
* environment, line 5413: Called python_src_compile
* environment, line 5189: Called python_execute_function '-d' '-s' '--'
* environment, line 4097: Called die
* The specific snippet of code:
* die "${failure_message}";
*
* If you need support, post the output of 'emerge --info
=dev-python/pygtk-2.16.0-r1',
* the complete build log and the output of 'emerge -pqv
=dev-python/pygtk-2.16.0-r1'.
* The complete build log is located at
'/var/tmp/portage/dev-python/pygtk-2.16.0-r1/temp/build.log'.
* The ebuild environment file is located at
'/var/tmp/portage/dev-python/pygtk-2.16.0-r1/temp/environment'.
* S: '/var/tmp/portage/dev-python/pygtk-2.16.0-r1/work/pygtk-2.16.0'

>>> Failed to emerge dev-python/pygtk-2.16.0-r1, Log file:

>>> '/var/tmp/portage/dev-python/pygtk-2.16.0-r1/temp/build.log'

* Messages for package dev-python/pygtk-2.16.0-r1:

* ERROR: dev-python/pygtk-2.16.0-r1 failed:
* Building failed with CPython 2.6 in python_default_function() function
*
* Call stack:
* ebuild.sh, line 48: Called src_compile
* environment, line 5413: Called python_src_compile
* environment, line 5189: Called python_execute_function '-d' '-s' '--'
* environment, line 4097: Called die
* The specific snippet of code:
* die "${failure_message}";
*
* If you need support, post the output of 'emerge --info
=dev-python/pygtk-2.16.0-r1',
* the complete build log and the output of 'emerge -pqv
=dev-python/pygtk-2.16.0-r1'.
* The complete build log is located at
'/var/tmp/portage/dev-python/pygtk-2.16.0-r1/temp/build.log'.
* The ebuild environment file is located at
'/var/tmp/portage/dev-python/pygtk-2.16.0-r1/temp/environment'.
* S: '/var/tmp/portage/dev-python/pygtk-2.16.0-r1/work/pygtk-2.16.0'

* GNU info directory index is up-to-date.

!!! existing preserved libs:
>>> package: media-libs/libpng-1.4.3
* - /usr/lib64/libpng12.so
* - /usr/lib64/libpng12.so.0
* - /usr/lib64/libpng12.so.0.43.0
* used by
/opt/icedtea6-bin-1.8.0/jre/lib/amd64/libsplashscreen.so
(dev-java/icedtea6-bin-1.8.0)
* used by /usr/bin/annotate (media-libs/gd-2.0.35-r1)
* used by /usr/bin/baobab (gnome-extra/gnome-utils-2.28.3)
* used by 405 other files
Use emerge @preserved-rebuild to rebuild packages using these libraries
c2stable ~ #
 
Old 06-27-2010, 07:47 PM
Mark Knecht
 
Default emerge @preserved-rebuild failure...

On Sun, Jun 27, 2010 at 12:42 PM, Mark Knecht <markknecht@gmail.com> wrote:
<SNIP>

Different machine getting updated and for the same failure but it
occurred on a different package.

- Mark

/bin/sh ../libtool --tag=CC --mode=link x86_64-pc-linux-gnu-gcc
-I/usr/include/libglade-2.0 -I/usr/include/gtk-2.0
-I/usr/include/libxml2 -I/usr/lib64/gtk-2.0/include
-I/usr/include/atk-1.0 -I/usr/include/cairo -I/usr/include/pango-1.0
-I/usr/include/glib-2.0 -I/usr/lib64/glib-2.0/include
-I/usr/include/pixman-1 -I/usr/include/freetype2
-I/usr/include/libpng14 -O2 -march=native -pipe -Wall
-fno-strict-aliasing -std=c9x -module -avoid-version
-export-symbols-regex initglade -Wl,-O1 -o glade.la -rpath
/usr/lib64/python2.6/site-packages/gtk-2.0/gtk
glade_la-libglademodule.lo glade_la-libglade.lo -lglade-2.0
-lgtk-x11-2.0 -lxml2 -lgdk-x11-2.0 -latk-1.0 -lgio-2.0 -lpangoft2-1.0
-lgdk_pixbuf-2.0 -lpangocairo-1.0 -lcairo -lpango-1.0 -lfreetype
-lfontconfig -lgobject-2.0 -lgmodule-2.0 -lglib-2.0
/bin/grep: /usr/lib64/libpng12.la: No such file or directory
/bin/sed: can't read /usr/lib64/libpng12.la: No such file or directory
libtool: link: `/usr/lib64/libpng12.la' is not a valid libtool archive
make[2]: *** [glade.la] Error 1
make[2]: *** Waiting for unfinished jobs....
mv -f .deps/gtkunixprint_la-gtkunixprint.Tpo
.deps/gtkunixprint_la-gtkunixprint.Plo
Could not write method GtkPaperSize.to_key_file: No ArgType for GKeyFile*
Could not write method GtkWidget.style_get: varargs functions not supported
Could not write virtual accessor method
GtkWidget.dispatch_child_properties_changed: No ArgType for
GParamSpec**
Could not write virtual accessor method GtkWidget.child_notify: No
ArgType for GParamSpec*
Could not write virtual proxy
GtkWidget.dispatch_child_properties_changed: No ArgType for
GParamSpec**
Could not write virtual proxy GtkWidget.child_notify: No ArgType for GParamSpec*
Could not write virtual proxy GtkContainer.child_type: No ArgType for GType
Could not write method GtkAccelGroup.activate: No ArgType for GQuark
Could not write method GtkAccelGroup.find: No ArgType for GtkAccelKey*
Could not write method GtkAccelGroup.query: No ArgType for guint*
Could not write method GtkActionGroup.set_translate_func: No ArgType
for GtkTranslateFunc
Could not write method GtkCalendar.set_detail_func: No ArgType for
GtkCalendarDetailFunc
Could not write virtual accessor method
GtkMenuItem.toggle_size_request: No ArgType for gint*
Warning: generating old-style constructor for:gtk_clipboard_get_for_display
Could not write method GtkClipboard.wait_for_uris: No ArgType for gchar**
Could not write method GtkClipboard.request_uris: No ArgType for
GtkClipboardURIReceivedFunc
Could not write virtual accessor method GtkCList.selection_find: No
ArgType for GList*
Could not write virtual accessor method GtkCList.draw_row: No ArgType
for GtkCListRow*
Could not write virtual accessor method GtkCList.draw_drag_highlight:
No ArgType for GtkCListRow*
Could not write virtual accessor method GtkCList.insert_row: No
ArgType for gchar*[]
Could not write virtual accessor method GtkCList.set_cell_contents: No
ArgType for GtkCListRow*
Could not write virtual accessor method GtkCList.cell_size_request: No
ArgType for GtkCListRow*
Could not write virtual proxy GtkCList.selection_find: No ArgType for GList*
Could not write virtual proxy GtkCList.draw_row: No ArgType for GtkCListRow*
Could not write virtual proxy GtkCList.draw_drag_highlight: No ArgType
for GtkCListRow*
Could not write virtual proxy GtkCList.insert_row: No ArgType for gchar*[]
Could not write virtual proxy GtkCList.set_cell_contents: No ArgType
for GtkCListRow*
Could not write virtual proxy GtkCList.cell_size_request: No ArgType
for GtkCListRow*
Could not write method GtkCTree.set_drag_compare_func: No ArgType for
GtkCTreeCompareDragFunc
Could not write virtual proxy GtkCTree.tree_select_row: No ArgType for
GtkCTreeNode*
Could not write virtual proxy GtkCTree.tree_unselect_row: No ArgType
for GtkCTreeNode*
Could not write virtual proxy GtkCTree.tree_expand: No ArgType for GtkCTreeNode*
Could not write virtual proxy GtkCTree.tree_collapse: No ArgType for
GtkCTreeNode*
Could not write virtual proxy GtkCTree.tree_move: No ArgType for GtkCTreeNode*
Could not write virtual accessor method GtkScale.get_layout_offsets:
No ArgType for gint*
Could not write virtual proxy GtkScale.get_layout_offsets: cannot use
int* parameter with direction 'None'
Could not write method GtkImage.get_gicon: No ArgType for GIcon**
Could not write virtual accessor method
GtkIMContext.get_preedit_string: No ArgType for gchar**
Could not write virtual accessor method GtkIMContext.get_surrounding:
No ArgType for gchar**
Could not write virtual proxy GtkIMContext.get_preedit_string: No
ArgType for gchar**
Could not write virtual proxy GtkIMContext.get_surrounding: No ArgType
for gchar**
Could not write method GtkIMContextSimple.add_table: No ArgType for guint16*
Warning: generating old-style constructor for:gtk_item_factory_new
Could not write method GtkListStore.set_valuesv: No ArgType for gint*
Could not write method GtkNotebook.set_group: No ArgType for gpointer
Could not write method GtkNotebook.get_group: No ArgType for gpointer
Could not write virtual accessor method GtkNotebook.switch_page: No
ArgType for GtkNotebookPage*
Could not write virtual proxy GtkNotebook.switch_page: No ArgType for
GtkNotebookPage*
Warning: generating old-style constructor for:gtk_preview_new
Could not write virtual accessor method GtkRcStyle.parse: No ArgType
for GScanner*
Could not write virtual proxy GtkRcStyle.parse: No ArgType for GScanner*
Could not write method GtkSettings.set_property_value: No ArgType for
const-GtkSettingsValue*
Could not write virtual accessor method GtkSpinButton.input: No
ArgType for gdouble*
Could not write method GtkStyle.get_style_property: No ArgType for GValue*
Could not write method GtkStyle.get_valist: No ArgType for va_list
Could not write method GtkStyle.get: varargs functions not supported
Could not write virtual accessor method GtkStyle.draw_polygon: No
ArgType for GdkPoint*
Could not write virtual proxy GtkStyle.draw_polygon: No ArgType for GdkPoint*
Could not write method GtkTreeSelection.get_user_data: No ArgType for gpointer
Could not write method GtkTreeSelection.get_select_function: No
ArgType for GtkTreeSelectionFunc
Could not write method GtkTreeStore.set_valuesv: No ArgType for gint*
Could not write method GtkTreeView.set_destroy_count_func: No ArgType
for GtkTreeDestroyCountFunc
Could not write method GtkWindowGroup.list_windows: No ArgType for GList*
Could not write method GtkPageSetup.to_key_file: No ArgType for GKeyFile*
Could not write method GtkPageSetup.load_key_file: No ArgType for GKeyFile*
Could not write method GtkPrintSettings.to_key_file: No ArgType for GKeyFile*
Could not write method GtkPrintSettings.load_key_file: No ArgType for GKeyFile*
Could not write virtual proxy GtkStatusIcon.popup_menu: No ArgType for guint32
Could not write method GtkBuilder.connect_signals_full: No ArgType for
GtkBuilderConnectFunc
Could not write method GtkBuilder.value_from_string: No ArgType for GParamSpec*
Could not write method GtkBuilder.value_from_string_type: No ArgType for GValue*
Could not write virtual proxy GtkBuilder.get_type_from_name: No
ArgType for GType
Warning: generating old-style constructor for:gtk_recent_action_new
Could not write virtual accessor method
GtkCellLayout.set_cell_data_func: No ArgType for GtkCellLayoutDataFunc
Could not write method GtkFileChooser.get_files: No ArgType for GSList*
Could not write virtual accessor method GtkTreeModel.rows_reordered:
No ArgType for gint*
Could not write virtual accessor method GtkTreeModel.get_value: No
ArgType for GValue*
Could not write interface proxy GtkTreeModel.rows_reordered: cannot
use int* parameter with direction 'None'
Could not write interface proxy GtkTreeModel.get_column_type: No
ArgType for GType
Could not write interface proxy GtkTreeModel.get_value: No ArgType for GValue*
Could not write virtual accessor method
GtkTreeSortable.get_sort_column_id: No ArgType for gint*
Could not write virtual accessor method GtkTreeSortable.set_sort_func:
No ArgType for GtkTreeIterCompareFunc
Could not write virtual accessor method
GtkTreeSortable.set_default_sort_func: No ArgType for
GtkTreeIterCompareFunc
Could not write interface proxy GtkTreeSortable.get_sort_column_id:
cannot use int* parameter with direction 'None'
Could not write interface proxy GtkTreeSortable.set_sort_func: No
ArgType for GtkTreeIterCompareFunc
Could not write interface proxy GtkTreeSortable.set_default_sort_func:
No ArgType for GtkTreeIterCompareFunc
Could not write virtual accessor method GtkRecentChooser.get_items: No
ArgType for GList*
Could not write virtual accessor method GtkRecentChooser.list_filters:
No ArgType for GSList*
Could not write virtual accessor method
GtkRecentChooser.set_sort_func: No ArgType for GtkRecentSortFunc
Could not write interface proxy GtkRecentChooser.get_items: No ArgType
for GList*
Could not write interface proxy GtkRecentChooser.list_filters: No
ArgType for GSList*
Could not write interface proxy GtkRecentChooser.set_sort_func: No
ArgType for GtkRecentSortFunc
Could not write method GtkBuildable.set_buildable_property: No ArgType
for const-GValue*
Could not write method GtkBuildable.custom_tag_start: No ArgType for
GMarkupParser*
Could not write method GtkBuildable.custom_tag_end: No ArgType for gpointer*
Could not write method GtkBuildable.custom_finished: No ArgType for gpointer
Could not write virtual accessor method GtkBuildable.get_name: No
ArgType for constgchar*
Could not write virtual accessor method
GtkBuildable.set_buildable_property: No ArgType for const-GValue*
Could not write virtual accessor method GtkBuildable.custom_tag_start:
No ArgType for GMarkupParser*
Could not write virtual accessor method GtkBuildable.custom_tag_end:
No ArgType for gpointer*
Could not write virtual accessor method GtkBuildable.custom_finished:
No ArgType for gpointer
Could not write interface proxy GtkBuildable.get_name: No ArgType for
constgchar*
Could not write interface proxy GtkBuildable.set_buildable_property:
No ArgType for const-GValue*
Could not write interface proxy GtkBuildable.custom_tag_start: No
ArgType for GMarkupParser*
Could not write interface proxy GtkBuildable.custom_tag_end: No
ArgType for gpointer*
Could not write interface proxy GtkBuildable.custom_finished: No
ArgType for gpointer
Could not write function accel_map_load_scanner: No ArgType for GScanner*
Could not write function binding_entry_clear: No ArgType for GtkBindingSet*
Could not write function binding_entry_add_signall: No ArgType for
GtkBindingSet*
Could not write function binding_parse_binding: No ArgType for GScanner*
Could not write function color_selection_set_change_palette_hook: No
ArgType for GtkColorSelectionChangePaletteFunc
Could not write function
color_selection_set_change_palette_with_screen_hoo k: No ArgType for
GtkColorSelectionChangePaletteWithScreenFunc
Could not write function file_paths_sort: No ArgType for GSList*
Could not write function item_factory_popup_data_from_widget: No
ArgType for gpointer
Could not write function init_add: No ArgType for GtkFunction
Could not write function parse_args: No ArgType for int*
Could not write function init_with_args: No ArgType for int*
Could not write function get_option_group: No ArgType for GOptionGroup*
Could not write function settings_install_property: No ArgType for GParamSpec*
Could not write function settings_install_property_parser: No ArgType
for GParamSpec*
Could not write function stock_add_static: No ArgType for const-GtkStockItem*
Could not write function stock_set_translate_func: No ArgType for
GtkTranslateFunc
Could not write function print_run_page_setup_dialog_async: No ArgType
for GtkPageSetupDoneFunc
Could not write function builder_error_quark: No ArgType for GQuark
Could not write function page_setup_new_from_key_file: No ArgType for GKeyFile*
Could not write function paper_size_get_paper_sizes: No ArgType for GList*
Could not write function paper_size_new_from_key_file: No ArgType for GKeyFile*
Could not write function print_settings_new_from_key_file: No ArgType
for GKeyFile*
Could not write function rc_parse_color_full: No ArgType for GScanner*
Warning: Constructor for GtkAccessible needs to be updated to new API
See http://live.gnome.org/PyGTK_2fWhatsNew28#update-constructors
Warning: Constructor for GtkClipboard needs to be updated to new API
See http://live.gnome.org/PyGTK_2fWhatsNew28#update-constructors
Warning: Constructor for GtkItemFactory needs to be updated to new API
See http://live.gnome.org/PyGTK_2fWhatsNew28#update-constructors
Warning: Constructor for GtkPreview needs to be updated to new API
See http://live.gnome.org/PyGTK_2fWhatsNew28#update-constructors
Warning: Constructor for GtkListItem needs to be updated to new API
See http://live.gnome.org/PyGTK_2fWhatsNew28#update-constructors
Warning: Constructor for GtkCList needs to be updated to new API
See http://live.gnome.org/PyGTK_2fWhatsNew28#update-constructors
Warning: Constructor for GtkCTree needs to be updated to new API
See http://live.gnome.org/PyGTK_2fWhatsNew28#update-constructors
Warning: Constructor for GtkMessageDialog needs to be updated to new API
See http://live.gnome.org/PyGTK_2fWhatsNew28#update-constructors
Warning: Constructor for GtkRecentAction needs to be updated to new API
See http://live.gnome.org/PyGTK_2fWhatsNew28#update-constructors
***INFO*** The coverage of global functions is 88.67% (180/203)
***INFO*** The coverage of methods is 98.58% (2496/2532)
***INFO*** The coverage of virtual proxies is 94.67% (391/413)
***INFO*** The coverage of virtual accessors is 93.99% (469/499)
***INFO*** The coverage of interface proxies is 83.72% (72/86)
mv -f .deps/_gtk_la-gdk.Tpo .deps/_gtk_la-gdk.Plo
make[2]: Leaving directory
`/var/tmp/portage/dev-python/pygtk-2.16.0-r1/work/pygtk-2.16.0-2.6/gtk'
make[1]: *** [all-recursive] Error 1
make[1]: Leaving directory
`/var/tmp/portage/dev-python/pygtk-2.16.0-r1/work/pygtk-2.16.0-2.6'
make: *** [all] Error 2
* ERROR: dev-python/pygtk-2.16.0-r1 failed:
* Building failed with CPython 2.6 in python_default_function() function
*
* Call stack:
* ebuild.sh, line 48: Called src_compile
* environment, line 5420: Called python_src_compile
* environment, line 5196: Called python_execute_function '-d' '-s' '--'
* environment, line 4104: Called die
* The specific snippet of code:
* die "${failure_message}";
*
* If you need support, post the output of 'emerge --info
=dev-python/pygtk-2.16.0-r1',
* the complete build log and the output of 'emerge -pqv
=dev-python/pygtk-2.16.0-r1'.
* The complete build log is located at
'/var/tmp/portage/dev-python/pygtk-2.16.0-r1/temp/build.log'.
* The ebuild environment file is located at
'/var/tmp/portage/dev-python/pygtk-2.16.0-r1/temp/environment'.
* S: '/var/tmp/portage/dev-python/pygtk-2.16.0-r1/work/pygtk-2.16.0'

>>> Failed to emerge dev-python/pygtk-2.16.0-r1, Log file:

>>> '/var/tmp/portage/dev-python/pygtk-2.16.0-r1/temp/build.log'

* Messages for package dev-python/pygtk-2.16.0-r1:

* ERROR: dev-python/pygtk-2.16.0-r1 failed:
* Building failed with CPython 2.6 in python_default_function() function
*
* Call stack:
* ebuild.sh, line 48: Called src_compile
* environment, line 5420: Called python_src_compile
* environment, line 5196: Called python_execute_function '-d' '-s' '--'
* environment, line 4104: Called die
* The specific snippet of code:
* die "${failure_message}";
*
* If you need support, post the output of 'emerge --info
=dev-python/pygtk-2.16.0-r1',
* the complete build log and the output of 'emerge -pqv
=dev-python/pygtk-2.16.0-r1'.
* The complete build log is located at
'/var/tmp/portage/dev-python/pygtk-2.16.0-r1/temp/build.log'.
* The ebuild environment file is located at
'/var/tmp/portage/dev-python/pygtk-2.16.0-r1/temp/environment'.
* S: '/var/tmp/portage/dev-python/pygtk-2.16.0-r1/work/pygtk-2.16.0'
k2 ~ #
 
Old 06-27-2010, 08:35 PM
Alan McKinnon
 
Default emerge @preserved-rebuild failure...

On Sunday 27 June 2010 21:42:14 Mark Knecht wrote:
> >> >>> Failed to emerge dev-python/libgnomecanvas-python-2.28.0, Log file:
> > The build error is before this. Please post that.
> >
> > Everything below is various elogs to tell you that an error occured, not
> > what it is.
> >
> >
> >
> > --
> > alan dot mckinnon at gmail dot com
>
> Yeah, should have posted more. Sorry.
>
> Hopefully this will get you far enough back to take a guess. Seems
> that libpng12.la doesn't exist and indeed that file isn't there.

Missing libpng.so?

Hah, the dev responsible for that ought to be shot. It wreaked havoc with
~arch a few months back, it's all in the archives in it's full glory.

The libpng ebuild has this message at the end, it's in your elogs:

"Run /usr/sbin/libpng-1.4.x-update.sh to fix libtool archives (.la)"

If stable is anything like unstable was, expect a long frustrating sequence of
revdep-rebuild and preserved-rebuild to fix it all.

Personally, this is one of those things that I fixed and forgot all about
(that's how frustrating it was). For the true facts, get the list archives.



--
alan dot mckinnon at gmail dot com
 
Old 06-27-2010, 08:59 PM
Mark Knecht
 
Default emerge @preserved-rebuild failure...

On Sun, Jun 27, 2010 at 1:35 PM, Alan McKinnon <alan.mckinnon@gmail.com> wrote:
> On Sunday 27 June 2010 21:42:14 Mark Knecht wrote:
>> >> >>> Failed to emerge dev-python/libgnomecanvas-python-2.28.0, Log file:
>> > The build error is before this. Please post that.
>> >
>> > Everything below is various elogs to tell you that an error occured, not
>> > what it is.
>> >
>> >
>> >
>> > --
>> > alan dot mckinnon at gmail dot com
>>
>> Yeah, should have posted more. Sorry.
>>
>> Hopefully this will get you far enough back to take a guess. Seems
>> that libpng12.la doesn't exist and indeed that file isn't there.
>
> Missing libpng.so?
>
> Hah, the dev responsible for that ought to be shot. It wreaked havoc with
> ~arch a few months back, it's all in the archives in it's full glory.
>
> The libpng ebuild has this message at the end, it's in your elogs:
>
> "Run /usr/sbin/libpng-1.4.x-update.sh to fix libtool archives (.la)"
>
> If stable is anything like unstable was, expect a long frustrating sequence of
> revdep-rebuild and preserved-rebuild to fix it all.
>
> Personally, this is one of those things that I fixed and forgot all about
> (that's how frustrating it was). For the true facts, get the list archives.
>
>
>
> --
> alan dot mckinnon at gmail dot com
>

Thanks. I'll give that a try in a minute. I found that running
revdep-rebuild -i first failed showing the same sort of error and then
the second time passed showing now errors:

* Messages for package mail-client/evolution-2.28.3.1:

* To change the default browser if you are not using GNOME, do:
* gconftool-2 --set /desktop/gnome/url-handlers/http/command -t
string 'mozilla %s'
* gconftool-2 --set /desktop/gnome/url-handlers/https/command -t
string 'mozilla %s'
*
* Replace 'mozilla %s' with which ever browser you use.
*
* Junk filters are now a run-time choice. You will get a choice of
* bogofilter or spamassassin based on which you have installed
*
* You have to install one of these for the spam filtering to actually work
>>> Auto-cleaning packages...

>>> No outdated packages were found on your system.

* GNU info directory index is up-to-date.

!!! existing preserved libs:
>>> package: media-libs/libpng-1.4.3
* - /usr/lib64/libpng12.so
* - /usr/lib64/libpng12.so.0
* - /usr/lib64/libpng12.so.0.43.0
* used by
/opt/icedtea6-bin-1.8.0/jre/lib/amd64/libsplashscreen.so
(dev-java/icedtea6-bin-1.8.0)
* used by /usr/bin/baobab (gnome-extra/gnome-utils-2.28.3)
* used by /usr/bin/blackjack (gnome-extra/gnome-games-2.28.2)
* used by 152 other files
Use emerge @preserved-rebuild to rebuild packages using these libraries
* Build finished correctly. Removing temporary files...
*
* You can re-run revdep-rebuild to verify that all libraries and binaries
* are fixed. Possible reasons for remaining inconsistencies include:
* orphaned files
* deep dependencies
* packages installed outside of portage's control
* specially-evaluated libraries
c2stable ~ # revdep-rebuild -ip
* Configuring search environment for revdep-rebuild

* Checking reverse dependencies
* Packages containing binaries and libraries broken by a package update
* will be emerged.

* Collecting system binaries and libraries
* Generated new 1_files.rr
* Collecting complete LD_LIBRARY_PATH
* Generated new 2_ldpath.rr
* Checking dynamic linking consistency
[ 100% ]

* Dynamic linking on your system is consistent... All done.
c2stable ~ #

emerge -p @preserved-rebuild still wants to build stuff so I'm
confused as the to the values of preserved-rebuild vs revdep-rebuild.
Things are getting confusing...

OK - tried your command but it's unclear whether it did anything:

c2stable ~ # /usr/sbin/libpng-1.4.x-update.sh
* Fixing broken libtool archives (.la)
c2stable ~ #


emerge @preserved-rebuild is now running again. I'll post back results later.

Thanks,
Mark
 
Old 06-27-2010, 11:36 PM
Mark Knecht
 
Default emerge @preserved-rebuild failure...

On Sun, Jun 27, 2010 at 1:59 PM, Mark Knecht <markknecht@gmail.com> wrote:
<SNIP>
>
>
> emerge @preserved-rebuild is now running again. I'll post back results later.
>
> Thanks,
> Mark
>

So it seems that after a couple of times through each of these tools,
and along with changes to firefox-bin to take care of new Flash
concerns someone is raising, things are fixed and the machine are
clean.

Thanks for the pointer on the libpng fixer. I don't see why this sort
of thing should be showing up on a stable release. Seems more the sort
of thing that should be worked out much earlier.

Cheers,
Mark
 

Thread Tools




All times are GMT. The time now is 05:11 AM.

VBulletin, Copyright ©2000 - 2014, Jelsoft Enterprises Ltd.
Content Relevant URLs by vBSEO ©2007, Crawlability, Inc.
Copyright 2007 - 2008, www.linux-archive.org