FAQ Search Today's Posts Mark Forums Read
» Video Reviews

» Linux Archive

Linux-archive is a website aiming to archive linux email lists and to make them easily accessible for linux users/developers.


» Sponsor

» Partners

» Sponsor

Go Back   Linux Archive > Gentoo > Gentoo Desktop

 
 
LinkBack Thread Tools
 
Old 02-24-2010, 11:40 AM
Dale
 
Default kopete-3.5.10-r5 from kde-sunset won't compile.

 
Old 02-24-2010, 11:47 AM
Dale
 
Default kopete-3.5.10-r5 from kde-sunset won't compile.

Hi,

Sorry for the last blank post. Seamonkey 2 is getting on my nerves
with this sending blank messages crap. Anyway. I'm trying to keep
KDE 3 around until KDE 4 gets its act together. I have ran into this
problem tho and can't get past it. This is the error I get for
kopete:

/usr/qt/3/bin/moc ./safedelete.h -o safedelete.moc
/bin/sh ../../../../libtool --silent --tag=CXX --mode=compile
i686-pc-linux-gnu-g++ -DHAVE_CONFIG_H -I. -I. -I../../../..
-I../../../../kopete/protocols/gadu/libgadu
-I../../../../kopete/protocols/groupwise/libgroupwise/qca/src
-I../../../../kopete/protocols/groupwise -I/usr/kde/3.5/include
-I/usr/qt/3/include -I. -DQT_THREAD_SUPPORT -D_REENTRANT
-D_FILE_OFFSET_BITS=64 -D_LARGE_FILES=1 -Wno-long-long -Wundef -ansi
-D_XOPEN_SOURCE=500 -D_BSD_SOURCE -Wcast-align -Wchar-subscripts -Wall
-W -Wpointer-arith -DNDEBUG -DNO_DEBUG -O2 -march=athlon-xp -O2 -pipe
-fomit-frame-pointer -Wformat-security -Wmissing-format-attribute
-Wno-non-virtual-dtor -fno-exceptions -fno-check-new -fno-common
-DQT_CLEAN_NAMESPACE -DQT_NO_ASCII_CAST -DQT_NO_STL -DQT_NO_COMPAT
-DQT_NO_TRANSLATION -c -o securestream.lo securestream.cpp
rtf.ll: In function 'int rtflex()':
rtf.ll:57: warning: ignoring return value of 'size_t fwrite(const
void*, size_t, size_t, FILE*)', declared with attribute
warn_unused_result
rtf.ll: In member function 'void RTF2HTML::PrintUnquoted(const char*,
...)':
rtf.ll:316: warning: function might be possible candidate for
'gnu_printf' format attribute
rtf.ll: In member function 'void Level::setText(const char*)':
rtf.ll:574: error: invalid conversion from 'const char*' to 'char*'
make[6]: *** [rtf.lo] Error 1
make[6]: *** Waiting for unfinished jobs....
make[6]: Leaving directory
`/var/tmp/portage/kde-base/kopete-3.5.10-r5/work/kopete-3.5.10/kopete/protocols/groupwise/libgroupwise'
make[5]: *** [all-recursive] Error 1
make[5]: Leaving directory
`/var/tmp/portage/kde-base/kopete-3.5.10-r5/work/kopete-3.5.10/kopete/protocols/groupwise/libgroupwise'
make[4]: *** [all-recursive] Error 1
make[4]: Leaving directory
`/var/tmp/portage/kde-base/kopete-3.5.10-r5/work/kopete-3.5.10/kopete/protocols/groupwise'
make[3]: *** [all-recursive] Error 1
make[3]: Leaving directory
`/var/tmp/portage/kde-base/kopete-3.5.10-r5/work/kopete-3.5.10/kopete/protocols'
make[2]: *** [all-recursive] Error 1
make[2]: Leaving directory
`/var/tmp/portage/kde-base/kopete-3.5.10-r5/work/kopete-3.5.10/kopete'
make[1]: *** [all-recursive] Error 1
make[1]: Leaving directory
`/var/tmp/portage/kde-base/kopete-3.5.10-r5/work/kopete-3.5.10'
make: *** [all] Error 2
* ERROR: kde-base/kopete-3.5.10-r5 failed:
* died running emake, kde_src_compile:make
*
* Call stack:
* ebuild.sh, line 48: Called src_compile
* environment, line 5024: Called kde_src_compile
* environment, line 3710: Called kde_src_compile 'all'
* environment, line 3725: Called kde_src_compile 'make'
* environment, line 3717: Called die
* The specific snippet of code:
* emake || die "died running emake, $FUNCNAME:make"
*
* If you need support, post the output of 'emerge --info
=kde-base/kopete-3.5.10-r5',
* the complete build log and the output of 'emerge -pqv
=kde-base/kopete-3.5.10-r5'.
* This ebuild used the following eclasses from overlays:
* /usr/local/portage/layman/kde-sunset/eclass/kde-meta.eclass
* /usr/local/portage/layman/kde-sunset/eclass/kde.eclass
* /usr/local/portage/layman/kde-sunset/eclass/kde-functions.eclass
* This ebuild is from an overlay named 'kde-sunset':
'/usr/local/portage/layman/kde-sunset/'
* The complete build log is located at
'/var/log/portage/elog/kde-base:kopete-3.5.10-r5:20100224-121454.log'.
* The ebuild environment file is located at
'/var/tmp/portage/kde-base/kopete-3.5.10-r5/temp/environment'.
* S: '/var/tmp/portage/kde-base/kopete-3.5.10-r5/work/kopete-3.5.10'

>>> Failed to emerge kde-base/kopete-3.5.10-r5, Log file:

>>> '/var/log/portage/elog/kde-base:kopete-3.5.10-r5:20100224-121454.log'

* IMPORTANT: 2 news items need reading for repository 'gentoo'.
* Use eselect news to read news items.

root@smoker ~ #


I did some googlin and it appears to be related to gcc. Is this a gcc
problem or a kopete problem? Everything else has compiled fine,
including the old KDE 3 packages. Here is a snippet of my emerge
--info in case it helps any:

root@smoker ~ # emerge --info
Portage 2.2_rc63 (default/linux/x86/10.0/desktop, gcc-4.4.2,
glibc-2.10.1-r1, 2.6.30-gentoo-r8 i686)
================================================== ===============
System uname: Linux-2.6.30-gentoo-r8-i686-AMD_Athlon-tm-_XP_2500+-with-gentoo-1.12.13
Timestamp of tree: Wed, 24 Feb 2010 00:45:01 +0000
app-shells/bash: 4.0_p35
dev-java/java-config: 2.1.10
dev-lang/python: 2.6.4, 3.1.1-r1
dev-util/cmake: 2.8.0-r2
sys-apps/baselayout: 1.12.13
sys-apps/sandbox: 2.2
sys-devel/autoconf: 2.13, 2.63-r1
sys-devel/automake: 1.8.5-r4, 1.9.6-r3, 1.10.3, 1.11.1
sys-devel/binutils: 2.18-r3
sys-devel/gcc: 4.4.2
sys-devel/gcc-config: 1.4.1
sys-devel/libtool: 2.2.6b
virtual/os-headers: 2.6.32
ACCEPT_KEYWORDS="x86"
ACCEPT_LICENSE="*"
CBUILD="i686-pc-linux-gnu"
CFLAGS="-march=athlon-xp -O2 -pipe -fomit-frame-pointer"
CHOST="i686-pc-linux-gnu"

Thoughts? Ideas?

Thanks.

Dale

:-) :-)
 
Old 02-24-2010, 02:04 PM
Martin von Gagern
 
Default kopete-3.5.10-r5 from kde-sunset won't compile.

Fixed your bug in kopete-3.5.10-r6:
http://git.overlays.gentoo.org/gitweb/?p=proj/kde-sunset.git;a=commit;h=919c6e3d10aa87162c9f88ece5f2 ce8edf54f32d
 
Old 02-24-2010, 02:31 PM
Andrew John Hughes
 
Default kopete-3.5.10-r5 from kde-sunset won't compile.

On 24 February 2010 15:04, Martin von Gagern <Martin.vGagern@gmx.net> wrote:
> Fixed your bug in kopete-3.5.10-r6:
> http://git.overlays.gentoo.org/gitweb/?p=proj/kde-sunset.git;a=commit;h=919c6e3d10aa87162c9f88ece5f2 ce8edf54f32d
>
>

Thanks for the prompt responses. The char*/const char* issue seems to
be a common one when building the old KDE code with newer versions of
GCC. I hit one myself, but was happy to see it fixed when I did an
update.

Keep up the good work,
--
Andrew :-)

Free Java Software Engineer
Red Hat, Inc. (http://www.redhat.com)

Support Free Java!
Contribute to GNU Classpath and the OpenJDK
http://www.gnu.org/software/classpath
http://openjdk.java.net

PGP Key: 94EFD9D8 (http://subkeys.pgp.net)
Fingerprint: F8EF F1EA 401E 2E60 15FA 7927 142C 2591 94EF D9D8
 
Old 02-25-2010, 02:13 AM
Dale
 
Default kopete-3.5.10-r5 from kde-sunset won't compile.

chrome://messenger/locale/messengercompose/composeMsgs.properties:

On 24 February 2010 15:04, Martin von Gagern<Martin.vGagern@gmx.net> wrote:


Fixed your bug in kopete-3.5.10-r6:
http://git.overlays.gentoo.org/gitweb/?p=proj/kde-sunset.git;a=commit;h=919c6e3d10aa87162c9f88ece5f2 ce8edf54f32d




Thanks for the prompt responses. The char*/const char* issue seems to
be a common one when building the old KDE code with newer versions of
GCC. I hit one myself, but was happy to see it fixed when I did an
update.

Keep up the good work,



Just to confirm that it compiled fine after the fix. You guys are
quicker on the overlay fixes than the portage devs. lol I didn't have
to file a bug either. :-)


I wish you could fix Seamonkey 2 and it sending blank emails. Replies
are fine but the first message to a mailing list has to be sent through
webmail. Weird.


Thanks much.

Dale

:-) :-)
 

Thread Tools




All times are GMT. The time now is 04:18 PM.

VBulletin, Copyright ©2000 - 2014, Jelsoft Enterprises Ltd.
Content Relevant URLs by vBSEO ©2007, Crawlability, Inc.
Copyright 2007 - 2008, www.linux-archive.org