FAQ Search Today's Posts Mark Forums Read
» Video Reviews

» Linux Archive

Linux-archive is a website aiming to archive linux email lists and to make them easily accessible for linux users/developers.


» Sponsor

» Partners

» Sponsor

Go Back   Linux Archive > Debian > Debian GCC

 
 
LinkBack Thread Tools
 
Old 11-17-2010, 04:54 PM
Matthias Klose
 
Default Results for 4.6.0 20101116 (experimental) (Debian 20101116-1) testsuite on sparc-unknown-linux-gnu

LAST_UPDATED: Tue Nov 16 06:39:54 UTC 2010 (revision 166792)

Target: sparc-linux-gnu
gcc version 4.6.0 20101116 (experimental) [trunk revision 166792] (Debian 20101116-1)

=== acats tests ===
FAIL: a83a02b
FAIL: a85013b
FAIL: a87b59a
FAIL: a95001c
FAIL: a95074d
FAIL: a97106a
FAIL: a99006a
FAIL: aa2010a
FAIL: ac3207a
FAIL: ad7201a
FAIL: ad7203b
FAIL: ad7205b
FAIL: ada101a
FAIL: c250002
FAIL: c34007j
FAIL: c34008a
FAIL: c35102a
FAIL: c37402a
FAIL: c37403a
FAIL: c380003
FAIL: c380004
FAIL: c38102d
FAIL: c38202a
FAIL: c39008a
FAIL: c39008b
FAIL: c39008c
FAIL: c3a1001
FAIL: c3a1002
FAIL: c410001
FAIL: c41306a
FAIL: c41306b
FAIL: c41306c
FAIL: c41307d
FAIL: c41401a
FAIL: c43204g
FAIL: c45282b
FAIL: c45291a
FAIL: c46051a
FAIL: c51004a
FAIL: c59002c
FAIL: c64201b
FAIL: c64201c
FAIL: c650001
FAIL: c74004a
FAIL: c74401k
FAIL: c74406a
FAIL: c761001
FAIL: c761007
FAIL: c83023a
FAIL: c85004b
FAIL: c85005a
FAIL: c85005b
FAIL: c85005c
FAIL: c85005d
FAIL: c85005e
FAIL: c85006a
FAIL: c85006b
FAIL: c85006c
FAIL: c85006d
FAIL: c85006e
FAIL: c85014a
FAIL: c85014b
FAIL: c85014c
FAIL: c85018a
FAIL: c85018b
FAIL: c87b26b
FAIL: c87b41a
FAIL: c87b45c
FAIL: c87b54a
FAIL: c87b62d
FAIL: c910001
FAIL: c910002
FAIL: c910003
FAIL: c91004b
FAIL: c91004c
FAIL: c91006a
FAIL: c91007a
FAIL: c92002a
FAIL: c92003a
FAIL: c92005a
FAIL: c92005b
FAIL: c92006a
FAIL: c930001
FAIL: c93001a
FAIL: c93002a
FAIL: c93003a
FAIL: c93004a
FAIL: c93004b
FAIL: c93004c
FAIL: c93004d
FAIL: c93004f
FAIL: c93005a
FAIL: c93005b
FAIL: c93005c
FAIL: c93005d
FAIL: c93005e
FAIL: c93005f
FAIL: c93005g
FAIL: c93005h
FAIL: c93006a
FAIL: c93007a
FAIL: c93008a
FAIL: c93008b
FAIL: c940001
FAIL: c940002
FAIL: c940004
FAIL: c940005
FAIL: c940006
FAIL: c940007
FAIL: c940010
FAIL: c940011
FAIL: c940012
FAIL: c940013
FAIL: c940014
FAIL: c940015
FAIL: c940016
FAIL: c94001a
FAIL: c94001b
FAIL: c94001c
FAIL: c94001e
FAIL: c94001f
FAIL: c94001g
FAIL: c94002a
FAIL: c94002b
FAIL: c94002d
FAIL: c94002e
FAIL: c94002f
FAIL: c94002g
FAIL: c94004a
FAIL: c94004b
FAIL: c94004c
FAIL: c94005a
FAIL: c94005b
FAIL: c94006a
FAIL: c94007a
FAIL: c94007b
FAIL: c94008a
FAIL: c94008b
FAIL: c94008c
FAIL: c94008d
FAIL: c94010a
FAIL: c94011a
FAIL: c94020a
FAIL: c940a03
FAIL: c95008a
FAIL: c95009a
FAIL: c95010a
FAIL: c95011a
FAIL: c95012a
FAIL: c95021a
FAIL: c95022a
FAIL: c95022b
FAIL: c95033a
FAIL: c95033b
FAIL: c95034a
FAIL: c95034b
FAIL: c95035a
FAIL: c95040a
FAIL: c95040b
FAIL: c95040c
FAIL: c95040d
FAIL: c95041a
FAIL: c95065a
FAIL: c95065b
FAIL: c95065c
FAIL: c95065d
FAIL: c95065e
FAIL: c95065f
FAIL: c95066a
FAIL: c95067a
FAIL: c95071a
FAIL: c95072a
FAIL: c95072b
FAIL: c95073a
FAIL: c95074c
FAIL: c95076a
FAIL: c95078a
FAIL: c95080b
FAIL: c95082g
FAIL: c95085a
FAIL: c95085b
FAIL: c95085c
FAIL: c95085d
FAIL: c95085e
FAIL: c95085f
FAIL: c95085g
FAIL: c95085h
FAIL: c95085i
FAIL: c95085j
FAIL: c95085k
FAIL: c95085l
FAIL: c95085m
FAIL: c95085n
FAIL: c95085o
FAIL: c95086a
FAIL: c95086b
FAIL: c95086c
FAIL: c95086d
FAIL: c95086e
FAIL: c95086f
FAIL: c95087a
FAIL: c95087b
FAIL: c95087c
FAIL: c95087d
FAIL: c95088a
FAIL: c95089a
FAIL: c95090a
FAIL: c95092a
FAIL: c95093a
FAIL: c95095a
FAIL: c95095b
FAIL: c95095c
FAIL: c95095d
FAIL: c95095e
FAIL: c951001
FAIL: c951002
FAIL: c953001
FAIL: c953002
FAIL: c953003
FAIL: c954001
FAIL: c954010
FAIL: c954011
FAIL: c954012
FAIL: c954013
FAIL: c954014
FAIL: c954015
FAIL: c954016
FAIL: c954017
FAIL: c954018
FAIL: c954019
FAIL: c954020
FAIL: c954021
FAIL: c954022
FAIL: c954023
FAIL: c954024
FAIL: c954025
FAIL: c954026
FAIL: c954a01
FAIL: c954a02
FAIL: c954a03
FAIL: c960001
FAIL: c960002
FAIL: c960004
FAIL: c97112a
FAIL: c97113a
FAIL: c97114a
FAIL: c97115a
FAIL: c97116a
FAIL: c97117a
FAIL: c97117b
FAIL: c97117c
FAIL: c97118a
FAIL: c97120a
FAIL: c97120b
FAIL: c97201a
FAIL: c97201b
FAIL: c97201c
FAIL: c97201d
FAIL: c97201e
FAIL: c97201g
FAIL: c97201h
FAIL: c97201x
FAIL: c97202a
FAIL: c97203a
FAIL: c97203b
FAIL: c97203c
FAIL: c97204a
FAIL: c97204b
FAIL: c97205a
FAIL: c97205b
FAIL: c97301a
FAIL: c97301b
FAIL: c97301c
FAIL: c97301d
FAIL: c97301e
FAIL: c97302a
FAIL: c97303a
FAIL: c97303b
FAIL: c97303c
FAIL: c97304a
FAIL: c97304b
FAIL: c97305a
FAIL: c97305b
FAIL: c97305c
FAIL: c97305d
FAIL: c97307a
FAIL: c974001
FAIL: c974002
FAIL: c974003
FAIL: c974004
FAIL: c974005
FAIL: c974006
FAIL: c974007
FAIL: c974008
FAIL: c974009
FAIL: c974010
FAIL: c974011
FAIL: c974012
FAIL: c974013
FAIL: c974014
FAIL: c980001
FAIL: c980002
FAIL: c980003
FAIL: c99004a
FAIL: c99005a
FAIL: c9a003a
FAIL: c9a004a
FAIL: c9a007a
FAIL: c9a009a
FAIL: c9a009c
FAIL: c9a009f
FAIL: c9a009g
FAIL: c9a009h
FAIL: c9a010a
FAIL: c9a011a
FAIL: c9a011b
FAIL: ca13001
FAIL: ca5004a
FAIL: cb1010a
FAIL: cb20001
FAIL: cb20004
FAIL: cb20005
FAIL: cb20006
FAIL: cb20007
FAIL: cb4013a
FAIL: cb41002
FAIL: cb5001a
FAIL: cb5001b
FAIL: cb5002a
FAIL: cc1104c
FAIL: cc1207b
FAIL: cc1225a
FAIL: cc1310a
FAIL: cc3019c
FAIL: cc3106b
FAIL: cc3120b
FAIL: cc3207b
FAIL: cc3225a
FAIL: cc3601c
FAIL: cc3602a
FAIL: cd10002
FAIL: cd1009k
FAIL: cd1009t
FAIL: cd1009u
FAIL: cd1c03e
FAIL: cd1c06a
FAIL: cd2a91c
FAIL: cd2c11a
FAIL: cd2c11d
FAIL: cd5003e
FAIL: cd72a02
FAIL: cxh3001
FAIL: cxh3002
FAIL: cxh3003
FAIL: la14010
FAIL: la14027

=== acats Summary ===
# of expected passes 1965
# of unexpected failures 356
Native configuration is sparc-unknown-linux-gnu

=== g++ tests ===


Running target unix
FAIL: g++.dg/lto/20090303 cp_lto_20090303_0.o-cp_lto_20090303_0.o execute -flto -flto-partition=1to1
UNRESOLVED: attribute_plugin.c compilation, -I. -I/build/buildd-gcc-snapshot_20101116-1-sparc-1assFt/gcc-snapshot-20101116/src/gcc/testsuite -I/build/buildd-gcc-snapshot_20101116-1-sparc-1assFt/gcc-snapshot-20101116/src/gcc/testsuite/../../gcc -I/build/buildd-gcc-snapshot_20101116-1-sparc-1assFt/gcc-snapshot-20101116/build/gcc/testsuite/g++/../../../gcc -I/build/buildd-gcc-snapshot_20101116-1-sparc-1assFt/gcc-snapshot-20101116/src/gcc/testsuite/../../include -I/build/buildd-gcc-snapshot_20101116-1-sparc-1assFt/gcc-snapshot-20101116/src/gcc/testsuite/../../libcpp/include -I/build/buildd-gcc-snapshot_20101116-1-sparc-1assFt/gcc-snapshot-20101116/build/gcc/testsuite/g++/../../../intl -DIN_GCC -fPIC -shared
UNRESOLVED: pragma_plugin.c compilation, -I. -I/build/buildd-gcc-snapshot_20101116-1-sparc-1assFt/gcc-snapshot-20101116/src/gcc/testsuite -I/build/buildd-gcc-snapshot_20101116-1-sparc-1assFt/gcc-snapshot-20101116/src/gcc/testsuite/../../gcc -I/build/buildd-gcc-snapshot_20101116-1-sparc-1assFt/gcc-snapshot-20101116/build/gcc/testsuite/g++/../../../gcc -I/build/buildd-gcc-snapshot_20101116-1-sparc-1assFt/gcc-snapshot-20101116/src/gcc/testsuite/../../include -I/build/buildd-gcc-snapshot_20101116-1-sparc-1assFt/gcc-snapshot-20101116/src/gcc/testsuite/../../libcpp/include -I/build/buildd-gcc-snapshot_20101116-1-sparc-1assFt/gcc-snapshot-20101116/build/gcc/testsuite/g++/../../../intl -DIN_GCC -fPIC -shared
UNRESOLVED: selfassign.c compilation, -I. -I/build/buildd-gcc-snapshot_20101116-1-sparc-1assFt/gcc-snapshot-20101116/src/gcc/testsuite -I/build/buildd-gcc-snapshot_20101116-1-sparc-1assFt/gcc-snapshot-20101116/src/gcc/testsuite/../../gcc -I/build/buildd-gcc-snapshot_20101116-1-sparc-1assFt/gcc-snapshot-20101116/build/gcc/testsuite/g++/../../../gcc -I/build/buildd-gcc-snapshot_20101116-1-sparc-1assFt/gcc-snapshot-20101116/src/gcc/testsuite/../../include -I/build/buildd-gcc-snapshot_20101116-1-sparc-1assFt/gcc-snapshot-20101116/src/gcc/testsuite/../../libcpp/include -I/build/buildd-gcc-snapshot_20101116-1-sparc-1assFt/gcc-snapshot-20101116/build/gcc/testsuite/g++/../../../intl -O -DIN_GCC -fPIC -shared
UNRESOLVED: dumb_plugin.c compilation, -I. -I/build/buildd-gcc-snapshot_20101116-1-sparc-1assFt/gcc-snapshot-20101116/src/gcc/testsuite -I/build/buildd-gcc-snapshot_20101116-1-sparc-1assFt/gcc-snapshot-20101116/src/gcc/testsuite/../../gcc -I/build/buildd-gcc-snapshot_20101116-1-sparc-1assFt/gcc-snapshot-20101116/build/gcc/testsuite/g++/../../../gcc -I/build/buildd-gcc-snapshot_20101116-1-sparc-1assFt/gcc-snapshot-20101116/src/gcc/testsuite/../../include -I/build/buildd-gcc-snapshot_20101116-1-sparc-1assFt/gcc-snapshot-20101116/src/gcc/testsuite/../../libcpp/include -I/build/buildd-gcc-snapshot_20101116-1-sparc-1assFt/gcc-snapshot-20101116/build/gcc/testsuite/g++/../../../intl -DIN_GCC -fPIC -shared
UNRESOLVED: header_plugin.c compilation, -I. -I/build/buildd-gcc-snapshot_20101116-1-sparc-1assFt/gcc-snapshot-20101116/src/gcc/testsuite -I/build/buildd-gcc-snapshot_20101116-1-sparc-1assFt/gcc-snapshot-20101116/src/gcc/testsuite/../../gcc -I/build/buildd-gcc-snapshot_20101116-1-sparc-1assFt/gcc-snapshot-20101116/build/gcc/testsuite/g++/../../../gcc -I/build/buildd-gcc-snapshot_20101116-1-sparc-1assFt/gcc-snapshot-20101116/src/gcc/testsuite/../../include -I/build/buildd-gcc-snapshot_20101116-1-sparc-1assFt/gcc-snapshot-20101116/src/gcc/testsuite/../../libcpp/include -I/build/buildd-gcc-snapshot_20101116-1-sparc-1assFt/gcc-snapshot-20101116/build/gcc/testsuite/g++/../../../intl -DIN_GCC -fPIC -shared

=== g++ Summary for unix ===

# of expected passes 24917
# of unexpected failures 1
# of expected failures 156
# of unresolved testcases 5
# of unsupported tests 389

Running target unix/-m64
FAIL: g++.dg/lto/20090303 cp_lto_20090303_0.o-cp_lto_20090303_0.o execute -flto -flto-partition=1to1
UNRESOLVED: attribute_plugin.c compilation, -I. -I/build/buildd-gcc-snapshot_20101116-1-sparc-1assFt/gcc-snapshot-20101116/src/gcc/testsuite -I/build/buildd-gcc-snapshot_20101116-1-sparc-1assFt/gcc-snapshot-20101116/src/gcc/testsuite/../../gcc -I/build/buildd-gcc-snapshot_20101116-1-sparc-1assFt/gcc-snapshot-20101116/build/gcc/testsuite/g++/../../../gcc -I/build/buildd-gcc-snapshot_20101116-1-sparc-1assFt/gcc-snapshot-20101116/src/gcc/testsuite/../../include -I/build/buildd-gcc-snapshot_20101116-1-sparc-1assFt/gcc-snapshot-20101116/src/gcc/testsuite/../../libcpp/include -I/build/buildd-gcc-snapshot_20101116-1-sparc-1assFt/gcc-snapshot-20101116/build/gcc/testsuite/g++/../../../intl -DIN_GCC -fPIC -shared
UNRESOLVED: pragma_plugin.c compilation, -I. -I/build/buildd-gcc-snapshot_20101116-1-sparc-1assFt/gcc-snapshot-20101116/src/gcc/testsuite -I/build/buildd-gcc-snapshot_20101116-1-sparc-1assFt/gcc-snapshot-20101116/src/gcc/testsuite/../../gcc -I/build/buildd-gcc-snapshot_20101116-1-sparc-1assFt/gcc-snapshot-20101116/build/gcc/testsuite/g++/../../../gcc -I/build/buildd-gcc-snapshot_20101116-1-sparc-1assFt/gcc-snapshot-20101116/src/gcc/testsuite/../../include -I/build/buildd-gcc-snapshot_20101116-1-sparc-1assFt/gcc-snapshot-20101116/src/gcc/testsuite/../../libcpp/include -I/build/buildd-gcc-snapshot_20101116-1-sparc-1assFt/gcc-snapshot-20101116/build/gcc/testsuite/g++/../../../intl -DIN_GCC -fPIC -shared
UNRESOLVED: selfassign.c compilation, -I. -I/build/buildd-gcc-snapshot_20101116-1-sparc-1assFt/gcc-snapshot-20101116/src/gcc/testsuite -I/build/buildd-gcc-snapshot_20101116-1-sparc-1assFt/gcc-snapshot-20101116/src/gcc/testsuite/../../gcc -I/build/buildd-gcc-snapshot_20101116-1-sparc-1assFt/gcc-snapshot-20101116/build/gcc/testsuite/g++/../../../gcc -I/build/buildd-gcc-snapshot_20101116-1-sparc-1assFt/gcc-snapshot-20101116/src/gcc/testsuite/../../include -I/build/buildd-gcc-snapshot_20101116-1-sparc-1assFt/gcc-snapshot-20101116/src/gcc/testsuite/../../libcpp/include -I/build/buildd-gcc-snapshot_20101116-1-sparc-1assFt/gcc-snapshot-20101116/build/gcc/testsuite/g++/../../../intl -O -DIN_GCC -fPIC -shared
UNRESOLVED: dumb_plugin.c compilation, -I. -I/build/buildd-gcc-snapshot_20101116-1-sparc-1assFt/gcc-snapshot-20101116/src/gcc/testsuite -I/build/buildd-gcc-snapshot_20101116-1-sparc-1assFt/gcc-snapshot-20101116/src/gcc/testsuite/../../gcc -I/build/buildd-gcc-snapshot_20101116-1-sparc-1assFt/gcc-snapshot-20101116/build/gcc/testsuite/g++/../../../gcc -I/build/buildd-gcc-snapshot_20101116-1-sparc-1assFt/gcc-snapshot-20101116/src/gcc/testsuite/../../include -I/build/buildd-gcc-snapshot_20101116-1-sparc-1assFt/gcc-snapshot-20101116/src/gcc/testsuite/../../libcpp/include -I/build/buildd-gcc-snapshot_20101116-1-sparc-1assFt/gcc-snapshot-20101116/build/gcc/testsuite/g++/../../../intl -DIN_GCC -fPIC -shared
UNRESOLVED: header_plugin.c compilation, -I. -I/build/buildd-gcc-snapshot_20101116-1-sparc-1assFt/gcc-snapshot-20101116/src/gcc/testsuite -I/build/buildd-gcc-snapshot_20101116-1-sparc-1assFt/gcc-snapshot-20101116/src/gcc/testsuite/../../gcc -I/build/buildd-gcc-snapshot_20101116-1-sparc-1assFt/gcc-snapshot-20101116/build/gcc/testsuite/g++/../../../gcc -I/build/buildd-gcc-snapshot_20101116-1-sparc-1assFt/gcc-snapshot-20101116/src/gcc/testsuite/../../include -I/build/buildd-gcc-snapshot_20101116-1-sparc-1assFt/gcc-snapshot-20101116/src/gcc/testsuite/../../libcpp/include -I/build/buildd-gcc-snapshot_20101116-1-sparc-1assFt/gcc-snapshot-20101116/build/gcc/testsuite/g++/../../../intl -DIN_GCC -fPIC -shared

=== g++ Summary for unix/-m64 ===

# of expected passes 25529
# of unexpected failures 1
# of expected failures 156
# of unresolved testcases 5
# of unsupported tests 386

=== g++ Summary ===

# of expected passes 50446
# of unexpected failures 2
# of expected failures 312
# of unresolved testcases 10
# of unsupported tests 775
/build/buildd-gcc-snapshot_20101116-1-sparc-1assFt/gcc-snapshot-20101116/build/gcc/testsuite/g++/../../g++ version 4.6.0 20101116 (experimental) [trunk revision 166792] (Debian 20101116-1)

=== gcc tests ===


Running target unix
FAIL: gcc.c-torture/execute/20101013-1.c execution, -O2
FAIL: gcc.c-torture/execute/20101013-1.c execution, -O3 -fomit-frame-pointer
FAIL: gcc.c-torture/execute/20101013-1.c execution, -O3 -fomit-frame-pointer -funroll-loops
FAIL: gcc.c-torture/execute/20101013-1.c execution, -O3 -fomit-frame-pointer -funroll-all-loops -finline-functions
FAIL: gcc.c-torture/execute/20101013-1.c execution, -O3 -g
FAIL: gcc.c-torture/execute/20101013-1.c execution, -O2 -flto -flto-partition=none
FAIL: gcc.c-torture/execute/20101013-1.c execution, -O2 -flto
FAIL: gcc.dg/cproj-fails-with-broken-glibc.c execution test
FAIL: gcc.dg/graphite/vect-pr43423.c scan-tree-dump-times vect "vectorized 2 loops" 1
UNRESOLVED: selfassign.c compilation, -I. -I/build/buildd-gcc-snapshot_20101116-1-sparc-1assFt/gcc-snapshot-20101116/src/gcc/testsuite -I/build/buildd-gcc-snapshot_20101116-1-sparc-1assFt/gcc-snapshot-20101116/src/gcc/testsuite/../../gcc -I/build/buildd-gcc-snapshot_20101116-1-sparc-1assFt/gcc-snapshot-20101116/build/gcc/testsuite/gcc/../../../gcc -I/build/buildd-gcc-snapshot_20101116-1-sparc-1assFt/gcc-snapshot-20101116/src/gcc/testsuite/../../include -I/build/buildd-gcc-snapshot_20101116-1-sparc-1assFt/gcc-snapshot-20101116/src/gcc/testsuite/../../libcpp/include -I/build/buildd-gcc-snapshot_20101116-1-sparc-1assFt/gcc-snapshot-20101116/build/gcc/testsuite/gcc/../../../intl -O -DIN_GCC -fPIC -shared
UNRESOLVED: ggcplug.c compilation, -I. -I/build/buildd-gcc-snapshot_20101116-1-sparc-1assFt/gcc-snapshot-20101116/src/gcc/testsuite -I/build/buildd-gcc-snapshot_20101116-1-sparc-1assFt/gcc-snapshot-20101116/src/gcc/testsuite/../../gcc -I/build/buildd-gcc-snapshot_20101116-1-sparc-1assFt/gcc-snapshot-20101116/build/gcc/testsuite/gcc/../../../gcc -I/build/buildd-gcc-snapshot_20101116-1-sparc-1assFt/gcc-snapshot-20101116/src/gcc/testsuite/../../include -I/build/buildd-gcc-snapshot_20101116-1-sparc-1assFt/gcc-snapshot-20101116/src/gcc/testsuite/../../libcpp/include -I/build/buildd-gcc-snapshot_20101116-1-sparc-1assFt/gcc-snapshot-20101116/build/gcc/testsuite/gcc/../../../intl -O -DIN_GCC -fPIC -shared
UNRESOLVED: one_time_plugin.c compilation, -I. -I/build/buildd-gcc-snapshot_20101116-1-sparc-1assFt/gcc-snapshot-20101116/src/gcc/testsuite -I/build/buildd-gcc-snapshot_20101116-1-sparc-1assFt/gcc-snapshot-20101116/src/gcc/testsuite/../../gcc -I/build/buildd-gcc-snapshot_20101116-1-sparc-1assFt/gcc-snapshot-20101116/build/gcc/testsuite/gcc/../../../gcc -I/build/buildd-gcc-snapshot_20101116-1-sparc-1assFt/gcc-snapshot-20101116/src/gcc/testsuite/../../include -I/build/buildd-gcc-snapshot_20101116-1-sparc-1assFt/gcc-snapshot-20101116/src/gcc/testsuite/../../libcpp/include -I/build/buildd-gcc-snapshot_20101116-1-sparc-1assFt/gcc-snapshot-20101116/build/gcc/testsuite/gcc/../../../intl -DIN_GCC -fPIC -shared
UNRESOLVED: start_unit_plugin.c compilation, -I. -I/build/buildd-gcc-snapshot_20101116-1-sparc-1assFt/gcc-snapshot-20101116/src/gcc/testsuite -I/build/buildd-gcc-snapshot_20101116-1-sparc-1assFt/gcc-snapshot-20101116/src/gcc/testsuite/../../gcc -I/build/buildd-gcc-snapshot_20101116-1-sparc-1assFt/gcc-snapshot-20101116/build/gcc/testsuite/gcc/../../../gcc -I/build/buildd-gcc-snapshot_20101116-1-sparc-1assFt/gcc-snapshot-20101116/src/gcc/testsuite/../../include -I/build/buildd-gcc-snapshot_20101116-1-sparc-1assFt/gcc-snapshot-20101116/src/gcc/testsuite/../../libcpp/include -I/build/buildd-gcc-snapshot_20101116-1-sparc-1assFt/gcc-snapshot-20101116/build/gcc/testsuite/gcc/../../../intl -DIN_GCC -fPIC -shared
UNRESOLVED: finish_unit_plugin.c compilation, -I. -I/build/buildd-gcc-snapshot_20101116-1-sparc-1assFt/gcc-snapshot-20101116/src/gcc/testsuite -I/build/buildd-gcc-snapshot_20101116-1-sparc-1assFt/gcc-snapshot-20101116/src/gcc/testsuite/../../gcc -I/build/buildd-gcc-snapshot_20101116-1-sparc-1assFt/gcc-snapshot-20101116/build/gcc/testsuite/gcc/../../../gcc -I/build/buildd-gcc-snapshot_20101116-1-sparc-1assFt/gcc-snapshot-20101116/src/gcc/testsuite/../../include -I/build/buildd-gcc-snapshot_20101116-1-sparc-1assFt/gcc-snapshot-20101116/src/gcc/testsuite/../../libcpp/include -I/build/buildd-gcc-snapshot_20101116-1-sparc-1assFt/gcc-snapshot-20101116/build/gcc/testsuite/gcc/../../../intl -DIN_GCC -fPIC -shared
XPASS: gcc.dg/tree-ssa/20040204-1.c scan-tree-dump-times optimized "link_error" 0
FAIL: gcc.dg/vect/pr46009.c scan-tree-dump-times vect "vectorized 1 loops" 2
XPASS: gcc.dg/vect/vect-peel-1.c scan-tree-dump-times vect "vectorized 1 loops" 2
XPASS: gcc.dg/vect/vect-peel-1.c scan-tree-dump-times vect "Alignment of access forced using peeling" 1
XPASS: gcc.dg/vect/vect-peel-2.c scan-tree-dump-times vect "vectorized 1 loops" 2
FAIL: gcc.dg/vect/vect-peel-3.c scan-tree-dump-times vect "vectorized 1 loops" 2
XPASS: gcc.dg/vect/vect-vfa-slp.c scan-tree-dump-times vect "vectorized 1 loops" 1
XPASS: gcc.dg/vect/slp-23.c scan-tree-dump-times vect "vectorizing stmts using SLP" 1
XPASS: gcc.dg/vect/slp-35.c scan-tree-dump-times vect "vectorized 1 loops" 1
XPASS: gcc.dg/vect/slp-35.c scan-tree-dump-times vect "vectorizing stmts using SLP" 1
FAIL: gcc.dg/vect/slp-multitypes-2.c execution test
FAIL: gcc.dg/vect/slp-reduc-3.c scan-tree-dump-times vect "vectorizing stmts using SLP" 1
FAIL: gcc.dg/vect/slp-reduc-6.c scan-tree-dump-times vect "vectorized 1 loops" 2
FAIL: gcc.dg/vect/no-section-anchors-vect-64.c scan-tree-dump-times vect "Alignment of access forced using peeling" 2
XPASS: gcc.dg/vect/no-tree-pre-slp-29.c scan-tree-dump-times vect "vectorized 1 loops" 2
XPASS: gcc.dg/vect/no-tree-pre-slp-29.c scan-tree-dump-times vect "vectorizing stmts using SLP" 2

=== gcc Summary for unix ===

# of expected passes 68673
# of unexpected failures 15
# of unexpected successes 10
# of expected failures 238
# of unresolved testcases 5
# of unsupported tests 1112

Running target unix/-m64
FAIL: gcc.dg/cproj-fails-with-broken-glibc.c execution test
UNRESOLVED: selfassign.c compilation, -I. -I/build/buildd-gcc-snapshot_20101116-1-sparc-1assFt/gcc-snapshot-20101116/src/gcc/testsuite -I/build/buildd-gcc-snapshot_20101116-1-sparc-1assFt/gcc-snapshot-20101116/src/gcc/testsuite/../../gcc -I/build/buildd-gcc-snapshot_20101116-1-sparc-1assFt/gcc-snapshot-20101116/build/gcc/testsuite/gcc/../../../gcc -I/build/buildd-gcc-snapshot_20101116-1-sparc-1assFt/gcc-snapshot-20101116/src/gcc/testsuite/../../include -I/build/buildd-gcc-snapshot_20101116-1-sparc-1assFt/gcc-snapshot-20101116/src/gcc/testsuite/../../libcpp/include -I/build/buildd-gcc-snapshot_20101116-1-sparc-1assFt/gcc-snapshot-20101116/build/gcc/testsuite/gcc/../../../intl -O -DIN_GCC -fPIC -shared
UNRESOLVED: ggcplug.c compilation, -I. -I/build/buildd-gcc-snapshot_20101116-1-sparc-1assFt/gcc-snapshot-20101116/src/gcc/testsuite -I/build/buildd-gcc-snapshot_20101116-1-sparc-1assFt/gcc-snapshot-20101116/src/gcc/testsuite/../../gcc -I/build/buildd-gcc-snapshot_20101116-1-sparc-1assFt/gcc-snapshot-20101116/build/gcc/testsuite/gcc/../../../gcc -I/build/buildd-gcc-snapshot_20101116-1-sparc-1assFt/gcc-snapshot-20101116/src/gcc/testsuite/../../include -I/build/buildd-gcc-snapshot_20101116-1-sparc-1assFt/gcc-snapshot-20101116/src/gcc/testsuite/../../libcpp/include -I/build/buildd-gcc-snapshot_20101116-1-sparc-1assFt/gcc-snapshot-20101116/build/gcc/testsuite/gcc/../../../intl -O -DIN_GCC -fPIC -shared
UNRESOLVED: one_time_plugin.c compilation, -I. -I/build/buildd-gcc-snapshot_20101116-1-sparc-1assFt/gcc-snapshot-20101116/src/gcc/testsuite -I/build/buildd-gcc-snapshot_20101116-1-sparc-1assFt/gcc-snapshot-20101116/src/gcc/testsuite/../../gcc -I/build/buildd-gcc-snapshot_20101116-1-sparc-1assFt/gcc-snapshot-20101116/build/gcc/testsuite/gcc/../../../gcc -I/build/buildd-gcc-snapshot_20101116-1-sparc-1assFt/gcc-snapshot-20101116/src/gcc/testsuite/../../include -I/build/buildd-gcc-snapshot_20101116-1-sparc-1assFt/gcc-snapshot-20101116/src/gcc/testsuite/../../libcpp/include -I/build/buildd-gcc-snapshot_20101116-1-sparc-1assFt/gcc-snapshot-20101116/build/gcc/testsuite/gcc/../../../intl -DIN_GCC -fPIC -shared
UNRESOLVED: start_unit_plugin.c compilation, -I. -I/build/buildd-gcc-snapshot_20101116-1-sparc-1assFt/gcc-snapshot-20101116/src/gcc/testsuite -I/build/buildd-gcc-snapshot_20101116-1-sparc-1assFt/gcc-snapshot-20101116/src/gcc/testsuite/../../gcc -I/build/buildd-gcc-snapshot_20101116-1-sparc-1assFt/gcc-snapshot-20101116/build/gcc/testsuite/gcc/../../../gcc -I/build/buildd-gcc-snapshot_20101116-1-sparc-1assFt/gcc-snapshot-20101116/src/gcc/testsuite/../../include -I/build/buildd-gcc-snapshot_20101116-1-sparc-1assFt/gcc-snapshot-20101116/src/gcc/testsuite/../../libcpp/include -I/build/buildd-gcc-snapshot_20101116-1-sparc-1assFt/gcc-snapshot-20101116/build/gcc/testsuite/gcc/../../../intl -DIN_GCC -fPIC -shared
UNRESOLVED: finish_unit_plugin.c compilation, -I. -I/build/buildd-gcc-snapshot_20101116-1-sparc-1assFt/gcc-snapshot-20101116/src/gcc/testsuite -I/build/buildd-gcc-snapshot_20101116-1-sparc-1assFt/gcc-snapshot-20101116/src/gcc/testsuite/../../gcc -I/build/buildd-gcc-snapshot_20101116-1-sparc-1assFt/gcc-snapshot-20101116/build/gcc/testsuite/gcc/../../../gcc -I/build/buildd-gcc-snapshot_20101116-1-sparc-1assFt/gcc-snapshot-20101116/src/gcc/testsuite/../../include -I/build/buildd-gcc-snapshot_20101116-1-sparc-1assFt/gcc-snapshot-20101116/src/gcc/testsuite/../../libcpp/include -I/build/buildd-gcc-snapshot_20101116-1-sparc-1assFt/gcc-snapshot-20101116/build/gcc/testsuite/gcc/../../../intl -DIN_GCC -fPIC -shared
XPASS: gcc.dg/tree-ssa/20040204-1.c scan-tree-dump-times optimized "link_error" 0
FAIL: gcc.dg/tree-ssa/gen-vect-11c.c scan-tree-dump-times vect "vectorized 0 loops" 1
FAIL: gcc.dg/tree-ssa/pr14814.c scan-tree-dump-times forwprop2 "&" 0
XPASS: gcc.dg/vect/pr33804.c scan-tree-dump-times vect "vectorized 1 loops" 1
XPASS: gcc.dg/vect/pr33804.c scan-tree-dump-times vect "vectorizing stmts using SLP" 1
FAIL: gcc.dg/vect/pr46009.c scan-tree-dump-times vect "vectorized 1 loops" 2
XPASS: gcc.dg/vect/vect-peel-1.c scan-tree-dump-times vect "vectorized 1 loops" 2
XPASS: gcc.dg/vect/vect-peel-1.c scan-tree-dump-times vect "Alignment of access forced using peeling" 1
XPASS: gcc.dg/vect/vect-peel-2.c scan-tree-dump-times vect "vectorized 1 loops" 2
FAIL: gcc.dg/vect/vect-peel-3.c scan-tree-dump-times vect "vectorized 1 loops" 2
XPASS: gcc.dg/vect/vect-vfa-slp.c scan-tree-dump-times vect "vectorized 1 loops" 1
XPASS: gcc.dg/vect/slp-23.c scan-tree-dump-times vect "vectorizing stmts using SLP" 1
XPASS: gcc.dg/vect/slp-24.c scan-tree-dump-times vect "vectorized 1 loops" 1
XPASS: gcc.dg/vect/slp-24.c scan-tree-dump-times vect "vectorizing stmts using SLP" 2
XPASS: gcc.dg/vect/slp-35.c scan-tree-dump-times vect "vectorized 1 loops" 1
XPASS: gcc.dg/vect/slp-35.c scan-tree-dump-times vect "vectorizing stmts using SLP" 1
FAIL: gcc.dg/vect/slp-reduc-3.c scan-tree-dump-times vect "vectorizing stmts using SLP" 1
FAIL: gcc.dg/vect/slp-reduc-6.c scan-tree-dump-times vect "vectorized 1 loops" 2
FAIL: gcc.dg/vect/no-section-anchors-vect-64.c scan-tree-dump-times vect "Alignment of access forced using peeling" 2
XPASS: gcc.dg/vect/no-tree-pre-slp-29.c scan-tree-dump-times vect "vectorized 1 loops" 2
XPASS: gcc.dg/vect/no-tree-pre-slp-29.c scan-tree-dump-times vect "vectorizing stmts using SLP" 2
FAIL: gcc.misc-tests/linkage.c link

=== gcc Summary for unix/-m64 ===

# of expected passes 69325
# of unexpected failures 9
# of unexpected successes 14
# of expected failures 230
# of unresolved testcases 5
# of unsupported tests 1109

=== gcc Summary ===

# of expected passes 137998
# of unexpected failures 24
# of unexpected successes 24
# of expected failures 468
# of unresolved testcases 10
# of unsupported tests 2221
/build/buildd-gcc-snapshot_20101116-1-sparc-1assFt/gcc-snapshot-20101116/build/gcc/xgcc version 4.6.0 20101116 (experimental) [trunk revision 166792] (Debian 20101116-1)

=== gfortran tests ===


Running target unix

=== gfortran Summary for unix ===

# of expected passes 37058
# of expected failures 55
# of unsupported tests 226

Running target unix/-m64
FAIL: gfortran.fortran-torture/execute/forall_7.f90 execution, -O2 -fomit-frame-pointer -finline-functions -funroll-loops
FAIL: gfortran.fortran-torture/execute/forall_7.f90 execution, -O3 -g

=== gfortran Summary for unix/-m64 ===

# of expected passes 37337
# of unexpected failures 2
# of expected failures 53
# of unsupported tests 89

=== gfortran Summary ===

# of expected passes 74395
# of unexpected failures 2
# of expected failures 108
# of unsupported tests 315
/build/buildd-gcc-snapshot_20101116-1-sparc-1assFt/gcc-snapshot-20101116/build/gcc/testsuite/gfortran/../../gfortran version 4.6.0 20101116 (experimental) [trunk revision 166792] (Debian 20101116-1)

=== gnat tests ===


Running target unix
FAIL: gnat.dg/curr_task.adb execution test
FAIL: gnat.dg/entry_queues.adb execution test
FAIL: gnat.dg/interface2.adb execution test
FAIL: gnat.dg/iprot_test.adb execution test
FAIL: gnat.dg/lto8.adb execution test
FAIL: gnat.dg/null_pointer_deref2.adb execution test
FAIL: gnat.dg/prot_def.adb execution test
FAIL: gnat.dg/protected_self_ref1.adb execution test
FAIL: gnat.dg/requeue1.adb execution test
FAIL: gnat.dg/stack_check1.adb execution test
FAIL: gnat.dg/stack_check2.adb execution test
FAIL: gnat.dg/task_stack_align.adb execution test
FAIL: gnat.dg/test_delay.adb execution test
FAIL: gnat.dg/test_image.adb execution test
FAIL: gnat.dg/test_prio.adb execution test
FAIL: gnat.dg/timer_cancel.adb execution test
FAIL: gnat.dg/timing_events.adb execution test

=== gnat Summary for unix ===

# of expected passes 835
# of unexpected failures 17
# of expected failures 10
# of unsupported tests 4

Running target unix/-m64
UNRESOLVED: gnat.dg/abstract_with_anonymous_result.adb compilation failed to produce executable
UNRESOLVED: gnat.dg/access4.adb compilation failed to produce executable
UNRESOLVED: gnat.dg/access_discr2.adb compilation failed to produce executable
UNRESOLVED: gnat.dg/access_test.adb compilation failed to produce executable
UNRESOLVED: gnat.dg/addr2.adb compilation failed to produce executable
UNRESOLVED: gnat.dg/address_conversion.adb compilation failed to produce executable
UNRESOLVED: gnat.dg/aggr1.adb compilation failed to produce executable
FAIL: gnat.dg/aggr12.adb scan-tree-dump-not original "{.i1=0, .i2=2}": dump file does not exist
FAIL: gnat.dg/aggr13.adb scan-tree-dump-not gimple "= {}": dump file does not exist
UNRESOLVED: gnat.dg/aggr14.adb compilation failed to produce executable
UNRESOLVED: gnat.dg/aggr3.adb compilation failed to produce executable
UNRESOLVED: gnat.dg/aliased_prefix_accessibility.adb compilation failed to produce executable
FAIL: gnat.dg/aliasing1.adb scan-tree-dump-not optimized "__gnat_rcheck": dump file does not exist
FAIL: gnat.dg/aliasing2.adb scan-tree-dump-not optimized "__gnat_rcheck": dump file does not exist
UNRESOLVED: gnat.dg/aliasing3.adb compilation failed to produce executable
UNRESOLVED: gnat.dg/align_check.adb compilation failed to produce executable
UNRESOLVED: gnat.dg/align_max.adb compilation failed to produce executable
UNRESOLVED: gnat.dg/aligned_vla.adb compilation failed to produce executable
UNRESOLVED: gnat.dg/alignment1.adb compilation failed to produce executable
UNRESOLVED: gnat.dg/alignment2.adb compilation failed to produce executable
FAIL: gnat.dg/alignment4.adb scan-tree-dump-not gimple ".F": dump file does not exist
FAIL: gnat.dg/alignment5.adb scan-tree-dump-not gimple ".F": dump file does not exist
FAIL: gnat.dg/alignment6.adb scan-tree-dump-not gimple "VIEW_CONVERT_EXPR": dump file does not exist
UNRESOLVED: gnat.dg/alignment7.adb compilation failed to produce executable
UNRESOLVED: gnat.dg/alignment8.adb compilation failed to produce executable
UNRESOLVED: gnat.dg/alignment9.adb compilation failed to produce executable
UNRESOLVED: gnat.dg/allocator_maxalign1.adb compilation failed to produce executable
FAIL: gnat.dg/ancestor_type.adb (test for errors, line 8)
UNRESOLVED: gnat.dg/array10.adb compilation failed to produce executable
FAIL: gnat.dg/array11.adb (test for warnings, line 8)
FAIL: gnat.dg/array11.adb (test for warnings, line 9)
FAIL: gnat.dg/array11.adb (test for warnings, line 12)
UNRESOLVED: gnat.dg/array12.adb compilation failed to produce executable
UNRESOLVED: gnat.dg/array3.adb compilation failed to produce executable
UNRESOLVED: gnat.dg/array4.adb compilation failed to produce executable
UNRESOLVED: gnat.dg/array5.adb compilation failed to produce executable
UNRESOLVED: gnat.dg/array6.adb compilation failed to produce executable
UNRESOLVED: gnat.dg/array9.adb compilation failed to produce executable
UNRESOLVED: gnat.dg/array_bounds_test.adb compilation failed to produce executable
UNRESOLVED: gnat.dg/assert1.adb compilation failed to produce executable
UNRESOLVED: gnat.dg/assign_from_packed.adb compilation failed to produce executable
FAIL: gnat.dg/atomic2.adb (test for warnings, line 7)
UNRESOLVED: gnat.dg/biased_uc.adb compilation failed to produce executable
UNRESOLVED: gnat.dg/bip_aggregate_bug.adb compilation failed to produce executable
UNRESOLVED: gnat.dg/bit_packed_array3.adb compilation failed to produce executable
UNRESOLVED: gnat.dg/blkextract_from_reg.adb compilation failed to produce executable
UNRESOLVED: gnat.dg/bltins.adb compilation failed to produce executable
UNRESOLVED: gnat.dg/boolean_bitfield.adb compilation failed to produce executable
UNRESOLVED: gnat.dg/boolean_conv.adb compilation failed to produce executable
UNRESOLVED: gnat.dg/boolean_expr2.adb compilation failed to produce executable
UNRESOLVED: gnat.dg/capture_value.adb compilation failed to produce executable
UNRESOLVED: gnat.dg/case_optimization2.adb compilation failed to produce executable
UNRESOLVED: gnat.dg/check_displace_generation.adb compilation failed to produce executable
UNRESOLVED: gnat.dg/check_elaboration_code.adb compilation failed to produce executable
UNRESOLVED: gnat.dg/compose.adb compilation failed to produce executable
UNRESOLVED: gnat.dg/concat1.adb compilation failed to produce executable
UNRESOLVED: gnat.dg/concat_length.adb compilation failed to produce executable
UNRESOLVED: gnat.dg/constant2.adb compilation failed to produce executable
UNRESOLVED: gnat.dg/controlled5.adb compilation failed to produce executable
UNRESOLVED: gnat.dg/conv_bug.adb compilation failed to produce executable
UNRESOLVED: gnat.dg/conv_decimal.adb compilation failed to produce executable
UNRESOLVED: gnat.dg/conv_real.adb compilation failed to produce executable
UNRESOLVED: gnat.dg/curr_task.adb compilation failed to produce executable
FAIL: gnat.dg/deferred_const1.adb (test for warnings, line 8)
UNRESOLVED: gnat.dg/deferred_const2.adb compilation failed to produce executable
UNRESOLVED: gnat.dg/deferred_const3.adb compilation failed to produce executable
UNRESOLVED: gnat.dg/derived_aggregate.adb compilation failed to produce executable
FAIL: gnat.dg/derived_type1.adb scan-tree-dump-not original "VIEW_CONVERT_EXPR<struct derived_type1__root>": dump file does not exist
FAIL: gnat.dg/derived_type1.adb scan-tree-dump-not original "VIEW_CONVERT_EXPR<struct derived_type1__derived1>": dump file does not exist
UNRESOLVED: gnat.dg/discr24.adb compilation failed to produce executable
UNRESOLVED: gnat.dg/discr4.adb compilation failed to produce executable
UNRESOLVED: gnat.dg/dispatch1.adb compilation failed to produce executable
UNRESOLVED: gnat.dg/dispatch2.adb compilation failed to produce executable
UNRESOLVED: gnat.dg/elim2.adb compilation failed to produce executable
UNRESOLVED: gnat.dg/empty_vector_length.adb compilation failed to produce executable
UNRESOLVED: gnat.dg/entry_queues.adb compilation failed to produce executable
UNRESOLVED: gnat.dg/enum1.adb compilation failed to produce executable
UNRESOLVED: gnat.dg/enum2.adb compilation failed to produce executable
UNRESOLVED: gnat.dg/exp0_eval.adb compilation failed to produce executable
UNRESOLVED: gnat.dg/expect1.adb compilation failed to produce executable
UNRESOLVED: gnat.dg/fixce.adb compilation failed to produce executable
UNRESOLVED: gnat.dg/fixedpnt.adb compilation failed to produce executable
FAIL: gnat.dg/frame_overflow.adb (test for errors, line 17)
FAIL: gnat.dg/frame_overflow.adb (test for errors, line 24)
UNRESOLVED: gnat.dg/generic_dispatch.adb compilation failed to produce executable
UNRESOLVED: gnat.dg/gnat_malloc.adb compilation failed to produce executable
UNRESOLVED: gnat.dg/handle_and_return.adb compilation failed to produce executable
UNRESOLVED: gnat.dg/handle_raise_from_pure.adb compilation failed to produce executable
UNRESOLVED: gnat.dg/hyper_flat.adb compilation failed to produce executable
UNRESOLVED: gnat.dg/in_out_parameter.adb compilation failed to produce executable
UNRESOLVED: gnat.dg/in_out_parameter2.adb compilation failed to produce executable
UNRESOLVED: gnat.dg/in_out_parameter3.adb compilation failed to produce executable
XPASS: gnat.dg/incomplete2.adb (test for excess errors)
UNRESOLVED: gnat.dg/init_scalar1.adb compilation failed to produce executable
UNRESOLVED: gnat.dg/inline_tagged.adb compilation failed to produce executable
UNRESOLVED: gnat.dg/interface1.adb compilation failed to produce executable
UNRESOLVED: gnat.dg/interface2.adb compilation failed to produce executable
UNRESOLVED: gnat.dg/interface3.adb compilation failed to produce executable
UNRESOLVED: gnat.dg/interface_conv.adb compilation failed to produce executable
UNRESOLVED: gnat.dg/iprot_test.adb compilation failed to produce executable
UNRESOLVED: gnat.dg/kill_value.adb compilation failed to produce executable
UNRESOLVED: gnat.dg/lhs_view_convert.adb compilation failed to produce executable
UNRESOLVED: gnat.dg/loop_boolean.adb compilation failed to produce executable
UNRESOLVED: gnat.dg/loop_optimization3.adb compilation failed to produce executable
UNRESOLVED: gnat.dg/loop_optimization4.adb compilation failed to produce executable
UNRESOLVED: gnat.dg/loop_optimization8.adb compilation failed to produce executable
UNRESOLVED: gnat.dg/lto1.adb compilation failed to produce executable
UNRESOLVED: gnat.dg/lto10.adb compilation failed to produce executable
UNRESOLVED: gnat.dg/lto5.adb compilation failed to produce executable
UNRESOLVED: gnat.dg/lto6.adb compilation failed to produce executable
UNRESOLVED: gnat.dg/lto7.adb compilation failed to produce executable
UNRESOLVED: gnat.dg/lto8.adb compilation failed to produce executable
UNRESOLVED: gnat.dg/lto9.adb compilation failed to produce executable
UNRESOLVED: gnat.dg/md5_test.adb compilation failed to produce executable
ERROR: gnat.dg/memtrap.adb: error executing dg-final: couldn't open "memtrap.s": no such file or directory
UNRESOLVED: gnat.dg/memtrap.adb: error executing dg-final: couldn't open "memtrap.s": no such file or directory
UNRESOLVED: gnat.dg/misaligned_nest.adb compilation failed to produce executable
UNRESOLVED: gnat.dg/misaligned_param.adb compilation failed to produce executable
UNRESOLVED: gnat.dg/missing_acc_check.adb compilation failed to produce executable
UNRESOLVED: gnat.dg/modular1.adb compilation failed to produce executable
UNRESOLVED: gnat.dg/modular2.adb compilation failed to produce executable
UNRESOLVED: gnat.dg/modular3.adb compilation failed to produce executable
UNRESOLVED: gnat.dg/mutable1.adb compilation failed to produce executable
UNRESOLVED: gnat.dg/named_test.adb compilation failed to produce executable
UNRESOLVED: gnat.dg/nat1r.adb compilation failed to produce executable
UNRESOLVED: gnat.dg/nested_controlled_alloc.adb compilation failed to produce executable
UNRESOLVED: gnat.dg/nested_proc1.adb compilation failed to produce executable
UNRESOLVED: gnat.dg/nested_return_test.adb compilation failed to produce executable
UNRESOLVED: gnat.dg/no_final.adb compilation failed to produce executable
UNRESOLVED: gnat.dg/not_null.adb compilation failed to produce executable
FAIL: gnat.dg/notnot.adb (test for warnings, line 6)
UNRESOLVED: gnat.dg/null_pointer_deref1.adb compilation failed to produce executable
UNRESOLVED: gnat.dg/null_pointer_deref2.adb compilation failed to produce executable
FAIL: gnat.dg/object_overflow.adb (test for warnings, line 8)
ERROR: gnat.dg/oconst1.adb: error executing dg-final: couldn't open "oconst1.s": no such file or directory
UNRESOLVED: gnat.dg/oconst1.adb: error executing dg-final: couldn't open "oconst1.s": no such file or directory
ERROR: gnat.dg/oconst2.adb: error executing dg-final: couldn't open "oconst2.s": no such file or directory
UNRESOLVED: gnat.dg/oconst2.adb: error executing dg-final: couldn't open "oconst2.s": no such file or directory
ERROR: gnat.dg/oconst3.adb: error executing dg-final: couldn't open "oconst3.s": no such file or directory
UNRESOLVED: gnat.dg/oconst3.adb: error executing dg-final: couldn't open "oconst3.s": no such file or directory
ERROR: gnat.dg/oconst4.adb: error executing dg-final: couldn't open "oconst4.s": no such file or directory
UNRESOLVED: gnat.dg/oconst4.adb: error executing dg-final: couldn't open "oconst4.s": no such file or directory
ERROR: gnat.dg/oconst5.adb: error executing dg-final: couldn't open "oconst5.s": no such file or directory
UNRESOLVED: gnat.dg/oconst5.adb: error executing dg-final: couldn't open "oconst5.s": no such file or directory
FAIL: gnat.dg/old_errors.adb (test for errors, line 7)
FAIL: gnat.dg/old_errors.adb (test for errors, line 16)
FAIL: gnat.dg/old_errors.adb (test for errors, line 28)
FAIL: gnat.dg/old_errors.adb (test for errors, line 34)
FAIL: gnat.dg/old_errors.adb (test for errors, line 38)
FAIL: gnat.dg/old_errors.adb (test for warnings, line 40)
FAIL: gnat.dg/old_errors.adb (test for errors, line 44)
UNRESOLVED: gnat.dg/opt2.adb compilation failed to produce executable
UNRESOLVED: gnat.dg/opt4.adb compilation failed to produce executable
UNRESOLVED: gnat.dg/opt5.adb compilation failed to produce executable
UNRESOLVED: gnat.dg/outer_agg_bitfield_constructor.adb compilation failed to produce executable
UNRESOLVED: gnat.dg/overflow_sum.adb compilation failed to produce executable
UNRESOLVED: gnat.dg/pack10.adb compilation failed to produce executable
UNRESOLVED: gnat.dg/pack11.adb compilation failed to produce executable
UNRESOLVED: gnat.dg/pack12.adb compilation failed to produce executable
UNRESOLVED: gnat.dg/pack3.adb compilation failed to produce executable
UNRESOLVED: gnat.dg/pack4.adb compilation failed to produce executable
FAIL: gnat.dg/pack8.adb (test for errors, line 19)
FAIL: gnat.dg/pack9.adb scan-tree-dump-not optimized "__gnat_rcheck": dump file does not exist
UNRESOLVED: gnat.dg/packed_subtype.adb compilation failed to produce executable
UNRESOLVED: gnat.dg/pointer_conversion.adb compilation failed to produce executable
UNRESOLVED: gnat.dg/prot_def.adb compilation failed to produce executable
UNRESOLVED: gnat.dg/protected_self_ref1.adb compilation failed to produce executable
FAIL: gnat.dg/protected_self_ref2.adb (test for errors, line 12)
UNRESOLVED: gnat.dg/quote.adb compilation failed to produce executable
UNRESOLVED: gnat.dg/range_check.adb compilation failed to produce executable
UNRESOLVED: gnat.dg/regpat1.adb compilation failed to produce executable
UNRESOLVED: gnat.dg/release_unc_maxalign.adb compilation failed to produce executable
UNRESOLVED: gnat.dg/renaming2.adb compilation failed to produce executable
UNRESOLVED: gnat.dg/renaming3.adb compilation failed to produce executable
UNRESOLVED: gnat.dg/rep_clause4.adb compilation failed to produce executable
UNRESOLVED: gnat.dg/requeue1.adb compilation failed to produce executable
UNRESOLVED: gnat.dg/scalar_mode_agg_compare.adb compilation failed to produce executable
UNRESOLVED: gnat.dg/self_aggregate_with_array.adb compilation failed to produce executable
UNRESOLVED: gnat.dg/self_aggregate_with_call.adb compilation failed to produce executable
UNRESOLVED: gnat.dg/self_aggregate_with_pointer.adb compilation failed to produce executable
UNRESOLVED: gnat.dg/self_aggregate_with_zeros.adb compilation failed to produce executable
UNRESOLVED: gnat.dg/sizetype1.adb compilation failed to produce executable
UNRESOLVED: gnat.dg/sizetype2.adb compilation failed to produce executable
UNRESOLVED: gnat.dg/sizetype4.adb compilation failed to produce executable
UNRESOLVED: gnat.dg/slice3.adb compilation failed to produce executable
UNRESOLVED: gnat.dg/slice4.adb compilation failed to produce executable
FAIL: gnat.dg/slice5.adb (test for warnings, line 15)
FAIL: gnat.dg/slice5.adb (test for warnings, line 21)
UNRESOLVED: gnat.dg/small_alignment.adb compilation failed to produce executable
UNRESOLVED: gnat.dg/socket1.adb compilation failed to produce executable
UNRESOLVED: gnat.dg/sort2.adb compilation failed to produce executable
UNRESOLVED: gnat.dg/spipaterr.adb compilation failed to produce executable
UNRESOLVED: gnat.dg/stack_check1.adb compilation failed to produce executable
UNRESOLVED: gnat.dg/stack_check2.adb compilation failed to produce executable
UNRESOLVED: gnat.dg/string_slice.adb compilation failed to produce executable
FAIL: gnat.dg/subp_elim_errors.adb (test for errors, line 25)
FAIL: gnat.dg/subp_elim_errors.adb (test for errors, line 27)
FAIL: gnat.dg/subp_elim_errors.adb (test for errors, line 29)
FAIL: gnat.dg/subp_elim_errors.adb (test for errors, line 31)
UNRESOLVED: gnat.dg/tag1.adb compilation failed to produce executable
UNRESOLVED: gnat.dg/tagged_alloc_free.adb compilation failed to produce executable
UNRESOLVED: gnat.dg/tail_call.adb compilation failed to produce executable
UNRESOLVED: gnat.dg/task_stack_align.adb compilation failed to produce executable
UNRESOLVED: gnat.dg/test_8bitlong_overflow.adb compilation failed to produce executable
UNRESOLVED: gnat.dg/test_address_null_init.adb compilation failed to produce executable
UNRESOLVED: gnat.dg/test_allocator_maxalign2.adb compilation failed to produce executable
UNRESOLVED: gnat.dg/test_bounded.adb compilation failed to produce executable
UNRESOLVED: gnat.dg/test_delay.adb compilation failed to produce executable
UNRESOLVED: gnat.dg/test_direct_io.adb compilation failed to produce executable
UNRESOLVED: gnat.dg/test_enum_io.adb compilation failed to produce executable
UNRESOLVED: gnat.dg/test_fixed_io.adb compilation failed to produce executable
UNRESOLVED: gnat.dg/test_iface_aggr.adb compilation failed to produce executable
UNRESOLVED: gnat.dg/test_ifaces.adb compilation failed to produce executable
UNRESOLVED: gnat.dg/test_image.adb compilation failed to produce executable
UNRESOLVED: gnat.dg/test_nested_subtype_byref.adb compilation failed to produce executable
UNRESOLVED: gnat.dg/test_oalign.adb compilation failed to produce executable
UNRESOLVED: gnat.dg/test_oconst.adb compilation failed to produce executable
UNRESOLVED: gnat.dg/test_prefix1.adb compilation failed to produce executable
UNRESOLVED: gnat.dg/test_prio.adb compilation failed to produce executable
UNRESOLVED: gnat.dg/test_raise_from_pure.adb compilation failed to produce executable
UNRESOLVED: gnat.dg/test_self.adb compilation failed to produce executable
UNRESOLVED: gnat.dg/test_self_ref.adb compilation failed to produce executable
UNRESOLVED: gnat.dg/test_table1.adb compilation failed to produce executable
UNRESOLVED: gnat.dg/test_tamdt.adb compilation failed to produce executable
UNRESOLVED: gnat.dg/test_time_stamp.adb compilation failed to produce executable
UNRESOLVED: gnat.dg/test_version.adb compilation failed to produce executable
UNRESOLVED: gnat.dg/testint.adb compilation failed to produce executable
UNRESOLVED: gnat.dg/tfren.adb compilation failed to produce executable
UNRESOLVED: gnat.dg/thin_pointer2.adb compilation failed to produce executable
UNRESOLVED: gnat.dg/timer_cancel.adb compilation failed to produce executable
UNRESOLVED: gnat.dg/timing_events.adb compilation failed to produce executable
ERROR: gnat.dg/trampoline1.adb: error executing dg-final: couldn't open "trampoline1.s": no such file or directory
UNRESOLVED: gnat.dg/trampoline1.adb: error executing dg-final: couldn't open "trampoline1.s": no such file or directory
UNRESOLVED: gnat.dg/trampoline2.adb compilation failed to produce executable
UNRESOLVED: gnat.dg/tree_static_use.adb compilation failed to produce executable
UNRESOLVED: gnat.dg/unc_memfree.adb compilation failed to produce executable
UNRESOLVED: gnat.dg/unchecked_convert1.adb compilation failed to produce executable
UNRESOLVED: gnat.dg/unchecked_convert2.adb compilation failed to produce executable
UNRESOLVED: gnat.dg/unchecked_convert3.adb compilation failed to produce executable
FAIL: gnat.dg/unchecked_convert5.adb (test for warnings, line 9)
UNRESOLVED: gnat.dg/unchecked_convert5.adb compilation failed to produce executable
FAIL: gnat.dg/unchecked_convert6.adb (test for warnings, line 9)
UNRESOLVED: gnat.dg/unchecked_convert6.adb compilation failed to produce executable
UNRESOLVED: gnat.dg/unchecked_union1.adb compilation failed to produce executable
FAIL: gnat.dg/uninit_func.adb (test for warnings, line 5)
UNRESOLVED: gnat.dg/valid1.adb compilation failed to produce executable
ERROR: gnat.dg/volatile3.adb: error executing dg-final: couldn't open "volatile3.s": no such file or directory
UNRESOLVED: gnat.dg/volatile3.adb: error executing dg-final: couldn't open "volatile3.s": no such file or directory
UNRESOLVED: gnat.dg/warn1.adb compilation failed to produce executable
FAIL: gnat.dg/warn4.adb (test for warnings, line 14)
FAIL: gnat.dg/warn4.adb (test for warnings, line 14)
FAIL: gnat.dg/warn5.adb (test for warnings, line 29)
UNRESOLVED: gnat.dg/wide_boolean.adb compilation failed to produce executable
UNRESOLVED: gnat.dg/wide_test.adb compilation failed to produce executable
FAIL: gnat.dg/specs/abstract_private.ads (test for errors, line 12)
FAIL: gnat.dg/specs/access_constant.ads (test for errors, line 10)
FAIL: gnat.dg/specs/access_constant_decl.ads (test for errors, line 9)
FAIL: gnat.dg/specs/addr1.ads (test for warnings, line 30)
FAIL: gnat.dg/specs/alignment2.ads (test for warnings, line 12)
FAIL: gnat.dg/specs/alignment2.ads (test for warnings, line 18)
FAIL: gnat.dg/specs/alignment2.ads (test for warnings, line 36)
FAIL: gnat.dg/specs/alignment2.ads (test for warnings, line 40)
XPASS: gnat.dg/specs/controlled1_pkg.ads (test for excess errors)
XPASS: gnat.dg/specs/fe_inlining_helper.ads (test for excess errors)
FAIL: gnat.dg/specs/import_abstract.ads (test for errors, line 5)
FAIL: gnat.dg/specs/integer_value.ads (test for errors, line 4)
FAIL: gnat.dg/specs/linker_section.ads (test for errors, line 6)
FAIL: gnat.dg/specs/linker_section.ads (test for errors, line 10)
XPASS: gnat.dg/specs/lto3_pkg1.ads (test for excess errors)
XPASS: gnat.dg/specs/lto3_pkg2.ads (test for excess errors)
FAIL: gnat.dg/specs/oversize.ads (test for errors, line 18)
FAIL: gnat.dg/specs/oversize.ads (test for errors, line 25)
FAIL: gnat.dg/specs/oversize.ads (test for errors, line 33)
FAIL: gnat.dg/specs/oversize.ads (test for errors, line 44)
XPASS: gnat.dg/specs/pack3_pkg.ads (test for excess errors)
FAIL: gnat.dg/specs/renamings.ads (test for errors, line 9)
FAIL: gnat.dg/specs/renamings.ads (test for errors, line 13)
XPASS: gnat.dg/specs/size_attribute1_pkg1.ads (test for excess errors)
XPASS: gnat.dg/specs/size_attribute1_pkg2.ads (test for excess errors)
FAIL: gnat.dg/specs/size_clause2.ads (test for errors, line 40)
FAIL: gnat.dg/specs/size_clause3.ads (test for errors, line 17)
FAIL: gnat.dg/specs/size_clause3.ads (test for errors, line 47)
ERROR: gnat.dg/specs/static_initializer.ads: error executing dg-final: couldn't open "static_initializer.s": no such file or directory
UNRESOLVED: gnat.dg/specs/static_initializer.ads: error executing dg-final: couldn't open "static_initializer.s": no such file or directory
ERROR: gnat.dg/specs/static_initializer2.ads: error executing dg-final: couldn't open "static_initializer2.s": no such file or directory
UNRESOLVED: gnat.dg/specs/static_initializer2.ads: error executing dg-final: couldn't open "static_initializer2.s": no such file or directory
FAIL: gnat.dg/specs/storage.ads (test for errors, line 6)
FAIL: gnat.dg/specs/tag2.ads (test for errors, line 11)
FAIL: gnat.dg/specs/tag2.ads (test for errors, line 12)
FAIL: gnat.dg/specs/tag2.ads (test for errors, line 13)
FAIL: gnat.dg/specs/variant_part.ads (test for errors, line 4)
XPASS: gnat.dg/specs/varsize_return_pkg1.ads (test for excess errors)
XPASS: gnat.dg/specs/varsize_return_pkg2.ads (test for excess errors)

=== gnat Summary for unix/-m64 ===

# of expected passes 579
# of unexpected failures 67
# of unexpected successes 10
# of unresolved testcases 206
# of unsupported tests 4

=== gnat Summary ===

# of expected passes 1414
# of unexpected failures 84
# of unexpected successes 10
# of expected failures 10
# of unresolved testcases 206
# of unsupported tests 8
=== obj-c++ tests ===


Running target unix
UNRESOLVED: obj-c++.dg/try-catch-2.mm -fgnu-runtime compilation failed to produce executable
UNRESOLVED: obj-c++.dg/try-catch-9.mm -fgnu-runtime compilation failed to produce executable
FAIL: obj-c++.dg/property/at-property-2.mm -fgnu-runtime (test for errors, line 12)

=== obj-c++ Summary for unix ===

# of expected passes 1112
# of unexpected failures 1
# of expected failures 2
# of unresolved testcases 2
# of unsupported tests 86

Running target unix/-m64
UNRESOLVED: obj-c++.dg/try-catch-2.mm -fgnu-runtime compilation failed to produce executable
UNRESOLVED: obj-c++.dg/try-catch-9.mm -fgnu-runtime compilation failed to produce executable
FAIL: obj-c++.dg/property/at-property-2.mm -fgnu-runtime (test for errors, line 12)

=== obj-c++ Summary for unix/-m64 ===

# of expected passes 1104
# of unexpected failures 1
# of expected failures 10
# of unresolved testcases 2
# of unsupported tests 86

=== obj-c++ Summary ===

# of expected passes 2216
# of unexpected failures 2
# of expected failures 12
# of unresolved testcases 4
# of unsupported tests 172
/build/buildd-gcc-snapshot_20101116-1-sparc-1assFt/gcc-snapshot-20101116/build/gcc/testsuite/obj-c++/../../g++ version 4.6.0 20101116 (experimental) [trunk revision 166792] (Debian 20101116-1)

=== objc tests ===


Running target unix
XPASS: objc.dg-struct-layout-encoding-1/t025_main.m execution test
XPASS: objc.dg-struct-layout-encoding-1/t026_main.m execution test
XPASS: objc.dg-struct-layout-encoding-1/t027_main.m execution test
XPASS: objc.dg-struct-layout-encoding-1/t028_main.m execution test
XPASS: objc.dg-struct-layout-encoding-1/t029_main.m execution test
XPASS: objc.dg-struct-layout-encoding-1/t030_main.m execution test
XPASS: objc.dg-struct-layout-encoding-1/t031_main.m execution test

=== objc Summary for unix ===

# of expected passes 2629
# of unexpected successes 7
# of expected failures 10
# of unsupported tests 74

Running target unix/-m64
XPASS: objc.dg-struct-layout-encoding-1/t025_main.m execution test
XPASS: objc.dg-struct-layout-encoding-1/t026_main.m execution test
XPASS: objc.dg-struct-layout-encoding-1/t027_main.m execution test
XPASS: objc.dg-struct-layout-encoding-1/t028_main.m execution test
XPASS: objc.dg-struct-layout-encoding-1/t029_main.m execution test
XPASS: objc.dg-struct-layout-encoding-1/t030_main.m execution test
XPASS: objc.dg-struct-layout-encoding-1/t031_main.m execution test

=== objc Summary for unix/-m64 ===

# of expected passes 2629
# of unexpected successes 7
# of expected failures 10
# of unsupported tests 74

=== objc Summary ===

# of expected passes 5258
# of unexpected successes 14
# of expected failures 20
# of unsupported tests 148
/build/buildd-gcc-snapshot_20101116-1-sparc-1assFt/gcc-snapshot-20101116/build/gcc/xgcc version 4.6.0 20101116 (experimental) [trunk revision 166792] (Debian 20101116-1)

=== libgomp tests ===


Running target unix

=== libgomp Summary for unix ===

# of expected passes 2526
# of unsupported tests 7

Running target unix/-m64

=== libgomp Summary for unix/-m64 ===

# of expected passes 2526
# of unsupported tests 7

=== libgomp Summary ===

# of expected passes 5052
# of unsupported tests 14
=== libmudflap tests ===


Running target unix
FAIL: libmudflap.c/fail40-frag.c output pattern test
FAIL: libmudflap.c/pass49-frag.c execution test
FAIL: libmudflap.c/pass49-frag.c output pattern test
FAIL: libmudflap.c/pass49-frag.c execution test
FAIL: libmudflap.c/pass49-frag.c output pattern test
FAIL: libmudflap.c/pass51-frag.c execution test
FAIL: libmudflap.c/pass51-frag.c execution test
FAIL: libmudflap.c/fail40-frag.c (-static) output pattern test
FAIL: libmudflap.c/pass49-frag.c (-static) execution test
FAIL: libmudflap.c/pass49-frag.c (-static) output pattern test
FAIL: libmudflap.c/pass49-frag.c (-static) execution test
FAIL: libmudflap.c/pass49-frag.c (-static) output pattern test
FAIL: libmudflap.c/pass51-frag.c (-static) execution test
FAIL: libmudflap.c/pass51-frag.c (-static) execution test
FAIL: libmudflap.c/fail40-frag.c (-O2) output pattern test
FAIL: libmudflap.c/pass49-frag.c (-O2) execution test
FAIL: libmudflap.c/pass49-frag.c (-O2) output pattern test
FAIL: libmudflap.c/pass49-frag.c (-O2) execution test
FAIL: libmudflap.c/pass49-frag.c (-O2) output pattern test
FAIL: libmudflap.c/pass51-frag.c (-O2) execution test
FAIL: libmudflap.c/pass51-frag.c (-O2) execution test
FAIL: libmudflap.c/fail40-frag.c (-O3) output pattern test
FAIL: libmudflap.c/pass49-frag.c (-O3) execution test
FAIL: libmudflap.c/pass49-frag.c (-O3) output pattern test
FAIL: libmudflap.c/pass49-frag.c (-O3) execution test
FAIL: libmudflap.c/pass49-frag.c (-O3) output pattern test
FAIL: libmudflap.c/pass51-frag.c (-O3) execution test
FAIL: libmudflap.c/pass51-frag.c (-O3) execution test
FAIL: libmudflap.c++/pass41-frag.cxx (-static) (test for excess errors)
WARNING: libmudflap.c++/pass41-frag.cxx (-static) compilation failed to produce executable

=== libmudflap Summary for unix ===

# of expected passes 1864
# of unexpected failures 29

Running target unix/-m64
FAIL: libmudflap.c/fail40-frag.c output pattern test
FAIL: libmudflap.c/pass49-frag.c execution test
FAIL: libmudflap.c/pass49-frag.c output pattern test
FAIL: libmudflap.c/pass49-frag.c execution test
FAIL: libmudflap.c/pass49-frag.c output pattern test
FAIL: libmudflap.c/pass51-frag.c execution test
FAIL: libmudflap.c/pass51-frag.c execution test
FAIL: libmudflap.c/fail40-frag.c (-static) output pattern test
FAIL: libmudflap.c/pass49-frag.c (-static) execution test
FAIL: libmudflap.c/pass49-frag.c (-static) output pattern test
FAIL: libmudflap.c/pass49-frag.c (-static) execution test
FAIL: libmudflap.c/pass49-frag.c (-static) output pattern test
FAIL: libmudflap.c/pass51-frag.c (-static) execution test
FAIL: libmudflap.c/pass51-frag.c (-static) execution test
FAIL: libmudflap.c/fail40-frag.c (-O2) output pattern test
FAIL: libmudflap.c/pass49-frag.c (-O2) execution test
FAIL: libmudflap.c/pass49-frag.c (-O2) output pattern test
FAIL: libmudflap.c/pass49-frag.c (-O2) execution test
FAIL: libmudflap.c/pass49-frag.c (-O2) output pattern test
FAIL: libmudflap.c/pass51-frag.c (-O2) execution test
FAIL: libmudflap.c/pass51-frag.c (-O2) execution test
FAIL: libmudflap.c/fail40-frag.c (-O3) output pattern test
FAIL: libmudflap.c/pass49-frag.c (-O3) execution test
FAIL: libmudflap.c/pass49-frag.c (-O3) output pattern test
FAIL: libmudflap.c/pass49-frag.c (-O3) execution test
FAIL: libmudflap.c/pass49-frag.c (-O3) output pattern test
FAIL: libmudflap.c/pass51-frag.c (-O3) execution test
FAIL: libmudflap.c/pass51-frag.c (-O3) execution test

=== libmudflap Summary for unix/-m64 ===

# of expected passes 1866
# of unexpected failures 28

=== libmudflap Summary ===

# of expected passes 3730
# of unexpected failures 57
=== libstdc++ tests ===


Running target unix
FAIL: 22_locale/time_get/get_date/wchar_t/4.cc execution test

=== libstdc++ Summary for unix ===

# of expected passes 7790
# of unexpected failures 1
# of expected failures 84
# of unsupported tests 194

Running target unix/-m64
FAIL: libstdc++-abi/abi_check
FAIL: 22_locale/time_get/get_date/wchar_t/4.cc execution test

=== libstdc++ Summary for unix/-m64 ===

# of expected passes 7937
# of unexpected failures 2
# of expected failures 84
# of unsupported tests 117

=== libstdc++ Summary ===

# of expected passes 15727
# of unexpected failures 3
# of expected failures 168
# of unsupported tests 311

Compiler version: 4.6.0 20101116 (experimental) [trunk revision 166792] (Debian 20101116-1)
Platform: sparc-unknown-linux-gnu
configure flags: -v --with-pkgversion='Debian 20101116-1' --with-bugurl=file:///usr/share/doc/gcc-snapshot/README.Bugs --enable-languages=c,ada,c++,fortran,objc,obj-c++ --prefix=/usr/lib/gcc-snapshot --enable-shared --enable-multiarch --enable-linker-build-id --with-system-zlib --disable-nls --enable-clocale=gnu --enable-libstdcxx-debug --enable-libstdcxx-time=yes --enable-plugin --enable-gold --enable-ld=default --with-plugin-ld=ld.gold --enable-objc-gc --enable-targets=all --with-long-double-128 --disable-werror --enable-checking=yes --build=sparc-linux-gnu --host=sparc-linux-gnu --target=sparc-linux-gnu
BOOT_CFLAGS=


Build Dependencies:
Desired=Unknown/Install/Remove/Purge/Hold
| Status=Not/Inst/Conf-files/Unpacked/halF-conf/Half-inst/trig-aWait/Trig-pend
|/ Err?=(none)/Reinst-required (Status,Err: uppercase=bad)
||/ Name Version Description
+++-===============================-======================-================================================== ======================
ii binutils 2.20.1-15 The GNU assembler, linker and binary utilities
ii g++-4.4 4.4.5-8 The GNU C++ compiler
pi g++-4.4-multilib 4.4.5-8 The GNU C++ compiler (multilib files)
pi g++-multilib 4:4.4.5-1 The GNU C++ compiler (multilib files)
ii libc6 2.11.2-7 Embedded GNU C Library: Shared libraries
pi libcloog-ppl-dev 0.15.9-2 the Chunky Loop Generator (development files)
pi libgmp3-dev 2:4.3.2+dfsg-1 Multiprecision arithmetic library developers tools
pi libmpc-dev 0.8.2-1+b1 multiple precision complex floating-point library development package
pi libmpfr-dev 3.0.0-2 multiple precision floating-point computation developers tools
pi libppl0.10-dev 0.10.2-9 Parma Polyhedra Library (development)


pr46040:
Proposed patch for PR target/46040

gcc-ice-hack-trunk:
Retry the build on an ice, save the calling options and preprocessed
source when the ice is reproducible.

gcc-ice-apport-trunk:
Report an ICE to apport (if apport is available
and the environment variable GCC_NOAPPORT is not set)

gold-and-ld-trunk:
Enable both gold and ld in a single toolchain.
New option -fuse-ld=ld.bfd, -fuse-ld=gold.

libjava-disable-static:
Disable building the static libjava.

libjava-fixed-symlinks:
Remove unneed '..' elements from symlinks in JAVA_HOME

libstdc++-arm-wno-abi:
Temporary work around:
On arm-linux-gnueabi run the libstdc++v3 testsuite with -Wno-abi

libstdc++-no-testsuite:
Don't run the libstdc++ testsuite on hppa and mipsel (timeouts on the buildds)

ada-mips:
Improve support for mips.

arm-unbreak-eabi-armv4t:
Fix armv4t build on ARM

gcc-multiarch-trunk:

mips-triarch:
Build a tri-arch compiler on mips-linux-gnu.
http://gcc.gnu.org/ml/gcc-patches/2009-03/msg01047.html

libjava-nobiarch-check:
For biarch builds, disable the testsuite for the non-default architecture
for runtime libraries, which are not built by default (libjava).

config-ml:
disable some biarch libraries for biarch builds

s390-biarch:
Build a bi-arch compiler on s390-linux-gnu.
http://gcc.gnu.org/ml/gcc-patches/2009-03/msg01044.html

gcc-powerpc-nof:
Don't build nof multlib on powerpc.

gcc-no-add-needed:
On linux targets pass --no-add-needed to the linker.

mips-fix-loongson2f-nop:
On mips, pass -mfix-loongson2f-nop to as, if -mno-fix-loongson2f-nop
is not passed.

gcc-system-root:
Avoid include paths starting with a double slash

Counting all warnings,
there are 0 warnings in stage3 of this bootstrap.

Number of warnings per file:

Number of warning types:


--
To UNSUBSCRIBE, email to debian-gcc-REQUEST@lists.debian.org
with a subject of "unsubscribe". Trouble? Contact listmaster@lists.debian.org
Archive: E1PImDJ-0002xW-Lm@ravel.debian.org">http://lists.debian.org/E1PImDJ-0002xW-Lm@ravel.debian.org
 

Thread Tools




All times are GMT. The time now is 12:44 AM.

VBulletin, Copyright ©2000 - 2014, Jelsoft Enterprises Ltd.
Content Relevant URLs by vBSEO ©2007, Crawlability, Inc.
Copyright 2007 - 2008, www.linux-archive.org