FAQ Search Today's Posts Mark Forums Read
» Video Reviews

» Linux Archive

Linux-archive is a website aiming to archive linux email lists and to make them easily accessible for linux users/developers.


» Sponsor

» Partners

» Sponsor

Go Back   Linux Archive > Debian > Debian GCC

 
 
LinkBack Thread Tools
 
Old 10-22-2010, 05:54 PM
Matthias Klose
 
Default Results for 4.6.0 20101016 (experimental) (Debian 20101016-1) testsuite on mipsel-unknown-linux-gnu

LAST_UPDATED: Sat Oct 16 11:48:27 UTC 2010 (revision 165538)

Target: mipsel-linux-gnu
gcc version 4.6.0 20101016 (experimental) [trunk revision 165538] (Debian 20101016-1)

=== acats tests ===
FAIL: c52103x
FAIL: c52104x
FAIL: c52104y
FAIL: c940013
FAIL: cb1010a

=== acats Summary ===
# of expected passes 2316
# of unexpected failures 5
Native configuration is mipsel-unknown-linux-gnu

=== g++ tests ===


Running target unix
FAIL: g++.dg/debug/dwarf2/lineno-simple1.C scan-assembler main:[^\t]*(\t.(fnstart|frame|mask|file)[^\t]*)*\t[^:]+:12\n
FAIL: g++.dg/abi/packed1.C (test for excess errors)
UNRESOLVED: attribute_plugin.c compilation, -I. -I/build/buildd-gcc-snapshot_20101016-1-mipsel-4lKiJl/gcc-snapshot-20101016/src/gcc/testsuite -I/build/buildd-gcc-snapshot_20101016-1-mipsel-4lKiJl/gcc-snapshot-20101016/src/gcc/testsuite/../../gcc -I/build/buildd-gcc-snapshot_20101016-1-mipsel-4lKiJl/gcc-snapshot-20101016/build/gcc/testsuite/g++/../../../gcc -I/build/buildd-gcc-snapshot_20101016-1-mipsel-4lKiJl/gcc-snapshot-20101016/src/gcc/testsuite/../../include -I/build/buildd-gcc-snapshot_20101016-1-mipsel-4lKiJl/gcc-snapshot-20101016/src/gcc/testsuite/../../libcpp/include -I/build/buildd-gcc-snapshot_20101016-1-mipsel-4lKiJl/gcc-snapshot-20101016/build/gcc/testsuite/g++/../../../intl -DIN_GCC -fPIC -shared
UNRESOLVED: pragma_plugin.c compilation, -I. -I/build/buildd-gcc-snapshot_20101016-1-mipsel-4lKiJl/gcc-snapshot-20101016/src/gcc/testsuite -I/build/buildd-gcc-snapshot_20101016-1-mipsel-4lKiJl/gcc-snapshot-20101016/src/gcc/testsuite/../../gcc -I/build/buildd-gcc-snapshot_20101016-1-mipsel-4lKiJl/gcc-snapshot-20101016/build/gcc/testsuite/g++/../../../gcc -I/build/buildd-gcc-snapshot_20101016-1-mipsel-4lKiJl/gcc-snapshot-20101016/src/gcc/testsuite/../../include -I/build/buildd-gcc-snapshot_20101016-1-mipsel-4lKiJl/gcc-snapshot-20101016/src/gcc/testsuite/../../libcpp/include -I/build/buildd-gcc-snapshot_20101016-1-mipsel-4lKiJl/gcc-snapshot-20101016/build/gcc/testsuite/g++/../../../intl -DIN_GCC -fPIC -shared
UNRESOLVED: selfassign.c compilation, -I. -I/build/buildd-gcc-snapshot_20101016-1-mipsel-4lKiJl/gcc-snapshot-20101016/src/gcc/testsuite -I/build/buildd-gcc-snapshot_20101016-1-mipsel-4lKiJl/gcc-snapshot-20101016/src/gcc/testsuite/../../gcc -I/build/buildd-gcc-snapshot_20101016-1-mipsel-4lKiJl/gcc-snapshot-20101016/build/gcc/testsuite/g++/../../../gcc -I/build/buildd-gcc-snapshot_20101016-1-mipsel-4lKiJl/gcc-snapshot-20101016/src/gcc/testsuite/../../include -I/build/buildd-gcc-snapshot_20101016-1-mipsel-4lKiJl/gcc-snapshot-20101016/src/gcc/testsuite/../../libcpp/include -I/build/buildd-gcc-snapshot_20101016-1-mipsel-4lKiJl/gcc-snapshot-20101016/build/gcc/testsuite/g++/../../../intl -O -DIN_GCC -fPIC -shared
UNRESOLVED: dumb_plugin.c compilation, -I. -I/build/buildd-gcc-snapshot_20101016-1-mipsel-4lKiJl/gcc-snapshot-20101016/src/gcc/testsuite -I/build/buildd-gcc-snapshot_20101016-1-mipsel-4lKiJl/gcc-snapshot-20101016/src/gcc/testsuite/../../gcc -I/build/buildd-gcc-snapshot_20101016-1-mipsel-4lKiJl/gcc-snapshot-20101016/build/gcc/testsuite/g++/../../../gcc -I/build/buildd-gcc-snapshot_20101016-1-mipsel-4lKiJl/gcc-snapshot-20101016/src/gcc/testsuite/../../include -I/build/buildd-gcc-snapshot_20101016-1-mipsel-4lKiJl/gcc-snapshot-20101016/src/gcc/testsuite/../../libcpp/include -I/build/buildd-gcc-snapshot_20101016-1-mipsel-4lKiJl/gcc-snapshot-20101016/build/gcc/testsuite/g++/../../../intl -DIN_GCC -fPIC -shared
UNRESOLVED: header_plugin.c compilation, -I. -I/build/buildd-gcc-snapshot_20101016-1-mipsel-4lKiJl/gcc-snapshot-20101016/src/gcc/testsuite -I/build/buildd-gcc-snapshot_20101016-1-mipsel-4lKiJl/gcc-snapshot-20101016/src/gcc/testsuite/../../gcc -I/build/buildd-gcc-snapshot_20101016-1-mipsel-4lKiJl/gcc-snapshot-20101016/build/gcc/testsuite/g++/../../../gcc -I/build/buildd-gcc-snapshot_20101016-1-mipsel-4lKiJl/gcc-snapshot-20101016/src/gcc/testsuite/../../include -I/build/buildd-gcc-snapshot_20101016-1-mipsel-4lKiJl/gcc-snapshot-20101016/src/gcc/testsuite/../../libcpp/include -I/build/buildd-gcc-snapshot_20101016-1-mipsel-4lKiJl/gcc-snapshot-20101016/build/gcc/testsuite/g++/../../../intl -DIN_GCC -fPIC -shared

=== g++ Summary for unix ===

# of expected passes 24277
# of unexpected failures 2
# of expected failures 150
# of unresolved testcases 5
# of unsupported tests 380

Running target unix/-mabi=64
FAIL: g++.dg/debug/dwarf2/icf.C scan-assembler \.section.*.debug_dcall
FAIL: g++.dg/debug/dwarf2/icf.C scan-assembler New caller
FAIL: g++.dg/debug/dwarf2/icf.C scan-assembler Caller DIE offset
FAIL: g++.dg/debug/dwarf2/icf.C scan-assembler Callee DIE offset
FAIL: g++.dg/debug/dwarf2/lineno-simple1.C scan-assembler main:[^\t]*(\t.(fnstart|frame|mask|file)[^\t]*)*\t[^:]+:12\n
FAIL: g++.dg/abi/packed1.C (test for excess errors)
FAIL: g++.dg/other/anon5.C (test for excess errors)
UNRESOLVED: attribute_plugin.c compilation, -I. -I/build/buildd-gcc-snapshot_20101016-1-mipsel-4lKiJl/gcc-snapshot-20101016/src/gcc/testsuite -I/build/buildd-gcc-snapshot_20101016-1-mipsel-4lKiJl/gcc-snapshot-20101016/src/gcc/testsuite/../../gcc -I/build/buildd-gcc-snapshot_20101016-1-mipsel-4lKiJl/gcc-snapshot-20101016/build/gcc/testsuite/g++/../../../gcc -I/build/buildd-gcc-snapshot_20101016-1-mipsel-4lKiJl/gcc-snapshot-20101016/src/gcc/testsuite/../../include -I/build/buildd-gcc-snapshot_20101016-1-mipsel-4lKiJl/gcc-snapshot-20101016/src/gcc/testsuite/../../libcpp/include -I/build/buildd-gcc-snapshot_20101016-1-mipsel-4lKiJl/gcc-snapshot-20101016/build/gcc/testsuite/g++/../../../intl -DIN_GCC -fPIC -shared
UNRESOLVED: pragma_plugin.c compilation, -I. -I/build/buildd-gcc-snapshot_20101016-1-mipsel-4lKiJl/gcc-snapshot-20101016/src/gcc/testsuite -I/build/buildd-gcc-snapshot_20101016-1-mipsel-4lKiJl/gcc-snapshot-20101016/src/gcc/testsuite/../../gcc -I/build/buildd-gcc-snapshot_20101016-1-mipsel-4lKiJl/gcc-snapshot-20101016/build/gcc/testsuite/g++/../../../gcc -I/build/buildd-gcc-snapshot_20101016-1-mipsel-4lKiJl/gcc-snapshot-20101016/src/gcc/testsuite/../../include -I/build/buildd-gcc-snapshot_20101016-1-mipsel-4lKiJl/gcc-snapshot-20101016/src/gcc/testsuite/../../libcpp/include -I/build/buildd-gcc-snapshot_20101016-1-mipsel-4lKiJl/gcc-snapshot-20101016/build/gcc/testsuite/g++/../../../intl -DIN_GCC -fPIC -shared
UNRESOLVED: selfassign.c compilation, -I. -I/build/buildd-gcc-snapshot_20101016-1-mipsel-4lKiJl/gcc-snapshot-20101016/src/gcc/testsuite -I/build/buildd-gcc-snapshot_20101016-1-mipsel-4lKiJl/gcc-snapshot-20101016/src/gcc/testsuite/../../gcc -I/build/buildd-gcc-snapshot_20101016-1-mipsel-4lKiJl/gcc-snapshot-20101016/build/gcc/testsuite/g++/../../../gcc -I/build/buildd-gcc-snapshot_20101016-1-mipsel-4lKiJl/gcc-snapshot-20101016/src/gcc/testsuite/../../include -I/build/buildd-gcc-snapshot_20101016-1-mipsel-4lKiJl/gcc-snapshot-20101016/src/gcc/testsuite/../../libcpp/include -I/build/buildd-gcc-snapshot_20101016-1-mipsel-4lKiJl/gcc-snapshot-20101016/build/gcc/testsuite/g++/../../../intl -O -DIN_GCC -fPIC -shared
UNRESOLVED: dumb_plugin.c compilation, -I. -I/build/buildd-gcc-snapshot_20101016-1-mipsel-4lKiJl/gcc-snapshot-20101016/src/gcc/testsuite -I/build/buildd-gcc-snapshot_20101016-1-mipsel-4lKiJl/gcc-snapshot-20101016/src/gcc/testsuite/../../gcc -I/build/buildd-gcc-snapshot_20101016-1-mipsel-4lKiJl/gcc-snapshot-20101016/build/gcc/testsuite/g++/../../../gcc -I/build/buildd-gcc-snapshot_20101016-1-mipsel-4lKiJl/gcc-snapshot-20101016/src/gcc/testsuite/../../include -I/build/buildd-gcc-snapshot_20101016-1-mipsel-4lKiJl/gcc-snapshot-20101016/src/gcc/testsuite/../../libcpp/include -I/build/buildd-gcc-snapshot_20101016-1-mipsel-4lKiJl/gcc-snapshot-20101016/build/gcc/testsuite/g++/../../../intl -DIN_GCC -fPIC -shared
UNRESOLVED: header_plugin.c compilation, -I. -I/build/buildd-gcc-snapshot_20101016-1-mipsel-4lKiJl/gcc-snapshot-20101016/src/gcc/testsuite -I/build/buildd-gcc-snapshot_20101016-1-mipsel-4lKiJl/gcc-snapshot-20101016/src/gcc/testsuite/../../gcc -I/build/buildd-gcc-snapshot_20101016-1-mipsel-4lKiJl/gcc-snapshot-20101016/build/gcc/testsuite/g++/../../../gcc -I/build/buildd-gcc-snapshot_20101016-1-mipsel-4lKiJl/gcc-snapshot-20101016/src/gcc/testsuite/../../include -I/build/buildd-gcc-snapshot_20101016-1-mipsel-4lKiJl/gcc-snapshot-20101016/src/gcc/testsuite/../../libcpp/include -I/build/buildd-gcc-snapshot_20101016-1-mipsel-4lKiJl/gcc-snapshot-20101016/build/gcc/testsuite/g++/../../../intl -DIN_GCC -fPIC -shared

=== g++ Summary for unix/-mabi=64 ===

# of expected passes 24888
# of unexpected failures 7
# of expected failures 150
# of unresolved testcases 5
# of unsupported tests 377

Running target unix/-mabi=n32
FAIL: g++.dg/debug/dwarf2/lineno-simple1.C scan-assembler main:[^\t]*(\t.(fnstart|frame|mask|file)[^\t]*)*\t[^:]+:12\n
FAIL: g++.dg/abi/packed1.C (test for excess errors)
UNRESOLVED: attribute_plugin.c compilation, -I. -I/build/buildd-gcc-snapshot_20101016-1-mipsel-4lKiJl/gcc-snapshot-20101016/src/gcc/testsuite -I/build/buildd-gcc-snapshot_20101016-1-mipsel-4lKiJl/gcc-snapshot-20101016/src/gcc/testsuite/../../gcc -I/build/buildd-gcc-snapshot_20101016-1-mipsel-4lKiJl/gcc-snapshot-20101016/build/gcc/testsuite/g++/../../../gcc -I/build/buildd-gcc-snapshot_20101016-1-mipsel-4lKiJl/gcc-snapshot-20101016/src/gcc/testsuite/../../include -I/build/buildd-gcc-snapshot_20101016-1-mipsel-4lKiJl/gcc-snapshot-20101016/src/gcc/testsuite/../../libcpp/include -I/build/buildd-gcc-snapshot_20101016-1-mipsel-4lKiJl/gcc-snapshot-20101016/build/gcc/testsuite/g++/../../../intl -DIN_GCC -fPIC -shared
UNRESOLVED: pragma_plugin.c compilation, -I. -I/build/buildd-gcc-snapshot_20101016-1-mipsel-4lKiJl/gcc-snapshot-20101016/src/gcc/testsuite -I/build/buildd-gcc-snapshot_20101016-1-mipsel-4lKiJl/gcc-snapshot-20101016/src/gcc/testsuite/../../gcc -I/build/buildd-gcc-snapshot_20101016-1-mipsel-4lKiJl/gcc-snapshot-20101016/build/gcc/testsuite/g++/../../../gcc -I/build/buildd-gcc-snapshot_20101016-1-mipsel-4lKiJl/gcc-snapshot-20101016/src/gcc/testsuite/../../include -I/build/buildd-gcc-snapshot_20101016-1-mipsel-4lKiJl/gcc-snapshot-20101016/src/gcc/testsuite/../../libcpp/include -I/build/buildd-gcc-snapshot_20101016-1-mipsel-4lKiJl/gcc-snapshot-20101016/build/gcc/testsuite/g++/../../../intl -DIN_GCC -fPIC -shared
UNRESOLVED: selfassign.c compilation, -I. -I/build/buildd-gcc-snapshot_20101016-1-mipsel-4lKiJl/gcc-snapshot-20101016/src/gcc/testsuite -I/build/buildd-gcc-snapshot_20101016-1-mipsel-4lKiJl/gcc-snapshot-20101016/src/gcc/testsuite/../../gcc -I/build/buildd-gcc-snapshot_20101016-1-mipsel-4lKiJl/gcc-snapshot-20101016/build/gcc/testsuite/g++/../../../gcc -I/build/buildd-gcc-snapshot_20101016-1-mipsel-4lKiJl/gcc-snapshot-20101016/src/gcc/testsuite/../../include -I/build/buildd-gcc-snapshot_20101016-1-mipsel-4lKiJl/gcc-snapshot-20101016/src/gcc/testsuite/../../libcpp/include -I/build/buildd-gcc-snapshot_20101016-1-mipsel-4lKiJl/gcc-snapshot-20101016/build/gcc/testsuite/g++/../../../intl -O -DIN_GCC -fPIC -shared
UNRESOLVED: dumb_plugin.c compilation, -I. -I/build/buildd-gcc-snapshot_20101016-1-mipsel-4lKiJl/gcc-snapshot-20101016/src/gcc/testsuite -I/build/buildd-gcc-snapshot_20101016-1-mipsel-4lKiJl/gcc-snapshot-20101016/src/gcc/testsuite/../../gcc -I/build/buildd-gcc-snapshot_20101016-1-mipsel-4lKiJl/gcc-snapshot-20101016/build/gcc/testsuite/g++/../../../gcc -I/build/buildd-gcc-snapshot_20101016-1-mipsel-4lKiJl/gcc-snapshot-20101016/src/gcc/testsuite/../../include -I/build/buildd-gcc-snapshot_20101016-1-mipsel-4lKiJl/gcc-snapshot-20101016/src/gcc/testsuite/../../libcpp/include -I/build/buildd-gcc-snapshot_20101016-1-mipsel-4lKiJl/gcc-snapshot-20101016/build/gcc/testsuite/g++/../../../intl -DIN_GCC -fPIC -shared
UNRESOLVED: header_plugin.c compilation, -I. -I/build/buildd-gcc-snapshot_20101016-1-mipsel-4lKiJl/gcc-snapshot-20101016/src/gcc/testsuite -I/build/buildd-gcc-snapshot_20101016-1-mipsel-4lKiJl/gcc-snapshot-20101016/src/gcc/testsuite/../../gcc -I/build/buildd-gcc-snapshot_20101016-1-mipsel-4lKiJl/gcc-snapshot-20101016/build/gcc/testsuite/g++/../../../gcc -I/build/buildd-gcc-snapshot_20101016-1-mipsel-4lKiJl/gcc-snapshot-20101016/src/gcc/testsuite/../../include -I/build/buildd-gcc-snapshot_20101016-1-mipsel-4lKiJl/gcc-snapshot-20101016/src/gcc/testsuite/../../libcpp/include -I/build/buildd-gcc-snapshot_20101016-1-mipsel-4lKiJl/gcc-snapshot-20101016/build/gcc/testsuite/g++/../../../intl -DIN_GCC -fPIC -shared

=== g++ Summary for unix/-mabi=n32 ===

# of expected passes 24932
# of unexpected failures 2
# of expected failures 150
# of unresolved testcases 5
# of unsupported tests 376

=== g++ Summary ===

# of expected passes 74097
# of unexpected failures 11
# of expected failures 450
# of unresolved testcases 15
# of unsupported tests 1133
/build/buildd-gcc-snapshot_20101016-1-mipsel-4lKiJl/gcc-snapshot-20101016/build/gcc/testsuite/g++/../../g++ version 4.6.0 20101016 (experimental) [trunk revision 165538] (Debian 20101016-1)

=== gcc tests ===


Running target unix
FAIL: gcc.c-torture/execute/20040709-2.c execution, -O1
FAIL: gcc.c-torture/execute/20040709-2.c execution, -Os
FAIL: gcc.dg/cproj-fails-with-broken-glibc.c execution test
FAIL: gcc.dg/uninit-pred-7_a.c bogus warning (test for bogus messages, line 26)
FAIL: gcc.dg/uninit-pred-8_a.c bogus warning (test for bogus messages, line 26)
FAIL: gcc.dg/fixed-point/composite-type.c (test for excess errors)
UNRESOLVED: selfassign.c compilation, -I. -I/build/buildd-gcc-snapshot_20101016-1-mipsel-4lKiJl/gcc-snapshot-20101016/src/gcc/testsuite -I/build/buildd-gcc-snapshot_20101016-1-mipsel-4lKiJl/gcc-snapshot-20101016/src/gcc/testsuite/../../gcc -I/build/buildd-gcc-snapshot_20101016-1-mipsel-4lKiJl/gcc-snapshot-20101016/build/gcc/testsuite/gcc/../../../gcc -I/build/buildd-gcc-snapshot_20101016-1-mipsel-4lKiJl/gcc-snapshot-20101016/src/gcc/testsuite/../../include -I/build/buildd-gcc-snapshot_20101016-1-mipsel-4lKiJl/gcc-snapshot-20101016/src/gcc/testsuite/../../libcpp/include -I/build/buildd-gcc-snapshot_20101016-1-mipsel-4lKiJl/gcc-snapshot-20101016/build/gcc/testsuite/gcc/../../../intl -O -DIN_GCC -fPIC -shared
UNRESOLVED: ggcplug.c compilation, -I. -I/build/buildd-gcc-snapshot_20101016-1-mipsel-4lKiJl/gcc-snapshot-20101016/src/gcc/testsuite -I/build/buildd-gcc-snapshot_20101016-1-mipsel-4lKiJl/gcc-snapshot-20101016/src/gcc/testsuite/../../gcc -I/build/buildd-gcc-snapshot_20101016-1-mipsel-4lKiJl/gcc-snapshot-20101016/build/gcc/testsuite/gcc/../../../gcc -I/build/buildd-gcc-snapshot_20101016-1-mipsel-4lKiJl/gcc-snapshot-20101016/src/gcc/testsuite/../../include -I/build/buildd-gcc-snapshot_20101016-1-mipsel-4lKiJl/gcc-snapshot-20101016/src/gcc/testsuite/../../libcpp/include -I/build/buildd-gcc-snapshot_20101016-1-mipsel-4lKiJl/gcc-snapshot-20101016/build/gcc/testsuite/gcc/../../../intl -O -DIN_GCC -fPIC -shared
UNRESOLVED: one_time_plugin.c compilation, -I. -I/build/buildd-gcc-snapshot_20101016-1-mipsel-4lKiJl/gcc-snapshot-20101016/src/gcc/testsuite -I/build/buildd-gcc-snapshot_20101016-1-mipsel-4lKiJl/gcc-snapshot-20101016/src/gcc/testsuite/../../gcc -I/build/buildd-gcc-snapshot_20101016-1-mipsel-4lKiJl/gcc-snapshot-20101016/build/gcc/testsuite/gcc/../../../gcc -I/build/buildd-gcc-snapshot_20101016-1-mipsel-4lKiJl/gcc-snapshot-20101016/src/gcc/testsuite/../../include -I/build/buildd-gcc-snapshot_20101016-1-mipsel-4lKiJl/gcc-snapshot-20101016/src/gcc/testsuite/../../libcpp/include -I/build/buildd-gcc-snapshot_20101016-1-mipsel-4lKiJl/gcc-snapshot-20101016/build/gcc/testsuite/gcc/../../../intl -DIN_GCC -fPIC -shared
UNRESOLVED: start_unit_plugin.c compilation, -I. -I/build/buildd-gcc-snapshot_20101016-1-mipsel-4lKiJl/gcc-snapshot-20101016/src/gcc/testsuite -I/build/buildd-gcc-snapshot_20101016-1-mipsel-4lKiJl/gcc-snapshot-20101016/src/gcc/testsuite/../../gcc -I/build/buildd-gcc-snapshot_20101016-1-mipsel-4lKiJl/gcc-snapshot-20101016/build/gcc/testsuite/gcc/../../../gcc -I/build/buildd-gcc-snapshot_20101016-1-mipsel-4lKiJl/gcc-snapshot-20101016/src/gcc/testsuite/../../include -I/build/buildd-gcc-snapshot_20101016-1-mipsel-4lKiJl/gcc-snapshot-20101016/src/gcc/testsuite/../../libcpp/include -I/build/buildd-gcc-snapshot_20101016-1-mipsel-4lKiJl/gcc-snapshot-20101016/build/gcc/testsuite/gcc/../../../intl -DIN_GCC -fPIC -shared
UNRESOLVED: finish_unit_plugin.c compilation, -I. -I/build/buildd-gcc-snapshot_20101016-1-mipsel-4lKiJl/gcc-snapshot-20101016/src/gcc/testsuite -I/build/buildd-gcc-snapshot_20101016-1-mipsel-4lKiJl/gcc-snapshot-20101016/src/gcc/testsuite/../../gcc -I/build/buildd-gcc-snapshot_20101016-1-mipsel-4lKiJl/gcc-snapshot-20101016/build/gcc/testsuite/gcc/../../../gcc -I/build/buildd-gcc-snapshot_20101016-1-mipsel-4lKiJl/gcc-snapshot-20101016/src/gcc/testsuite/../../include -I/build/buildd-gcc-snapshot_20101016-1-mipsel-4lKiJl/gcc-snapshot-20101016/src/gcc/testsuite/../../libcpp/include -I/build/buildd-gcc-snapshot_20101016-1-mipsel-4lKiJl/gcc-snapshot-20101016/build/gcc/testsuite/gcc/../../../intl -DIN_GCC -fPIC -shared
FAIL: gcc.dg/tree-prof/inliner-1.c scan-tree-dump-not optimized "hot_function ..;"
FAIL: gcc.dg/tree-ssa/vrp51.c scan-assembler-not bug.
FAIL: gcc.target/mips/dspr2-MULT.c scan-assembler ac2
FAIL: gcc.target/mips/dspr2-MULTU.c scan-assembler ac2

=== gcc Summary for unix ===

# of expected passes 68833
# of unexpected failures 10
# of expected failures 130
# of unresolved testcases 5
# of unsupported tests 880

Running target unix/-mabi=64
FAIL: gcc.dg/cproj-fails-with-broken-glibc.c execution test
FAIL: gcc.dg/uninit-pred-7_a.c bogus warning (test for bogus messages, line 26)
FAIL: gcc.dg/uninit-pred-8_a.c bogus warning (test for bogus messages, line 26)
FAIL: gcc.dg/fixed-point/composite-type.c (test for excess errors)
FAIL: gcc.dg/lto/20090116 c_lto_20090116_0.o-c_lto_20090116_0.o link, -O1 -fwhopr -fPIC (internal compiler error)
UNRESOLVED: gcc.dg/lto/20090116 c_lto_20090116_0.o-c_lto_20090116_0.o execute -O1 -fwhopr -fPIC
UNRESOLVED: selfassign.c compilation, -I. -I/build/buildd-gcc-snapshot_20101016-1-mipsel-4lKiJl/gcc-snapshot-20101016/src/gcc/testsuite -I/build/buildd-gcc-snapshot_20101016-1-mipsel-4lKiJl/gcc-snapshot-20101016/src/gcc/testsuite/../../gcc -I/build/buildd-gcc-snapshot_20101016-1-mipsel-4lKiJl/gcc-snapshot-20101016/build/gcc/testsuite/gcc/../../../gcc -I/build/buildd-gcc-snapshot_20101016-1-mipsel-4lKiJl/gcc-snapshot-20101016/src/gcc/testsuite/../../include -I/build/buildd-gcc-snapshot_20101016-1-mipsel-4lKiJl/gcc-snapshot-20101016/src/gcc/testsuite/../../libcpp/include -I/build/buildd-gcc-snapshot_20101016-1-mipsel-4lKiJl/gcc-snapshot-20101016/build/gcc/testsuite/gcc/../../../intl -O -DIN_GCC -fPIC -shared
UNRESOLVED: ggcplug.c compilation, -I. -I/build/buildd-gcc-snapshot_20101016-1-mipsel-4lKiJl/gcc-snapshot-20101016/src/gcc/testsuite -I/build/buildd-gcc-snapshot_20101016-1-mipsel-4lKiJl/gcc-snapshot-20101016/src/gcc/testsuite/../../gcc -I/build/buildd-gcc-snapshot_20101016-1-mipsel-4lKiJl/gcc-snapshot-20101016/build/gcc/testsuite/gcc/../../../gcc -I/build/buildd-gcc-snapshot_20101016-1-mipsel-4lKiJl/gcc-snapshot-20101016/src/gcc/testsuite/../../include -I/build/buildd-gcc-snapshot_20101016-1-mipsel-4lKiJl/gcc-snapshot-20101016/src/gcc/testsuite/../../libcpp/include -I/build/buildd-gcc-snapshot_20101016-1-mipsel-4lKiJl/gcc-snapshot-20101016/build/gcc/testsuite/gcc/../../../intl -O -DIN_GCC -fPIC -shared
UNRESOLVED: one_time_plugin.c compilation, -I. -I/build/buildd-gcc-snapshot_20101016-1-mipsel-4lKiJl/gcc-snapshot-20101016/src/gcc/testsuite -I/build/buildd-gcc-snapshot_20101016-1-mipsel-4lKiJl/gcc-snapshot-20101016/src/gcc/testsuite/../../gcc -I/build/buildd-gcc-snapshot_20101016-1-mipsel-4lKiJl/gcc-snapshot-20101016/build/gcc/testsuite/gcc/../../../gcc -I/build/buildd-gcc-snapshot_20101016-1-mipsel-4lKiJl/gcc-snapshot-20101016/src/gcc/testsuite/../../include -I/build/buildd-gcc-snapshot_20101016-1-mipsel-4lKiJl/gcc-snapshot-20101016/src/gcc/testsuite/../../libcpp/include -I/build/buildd-gcc-snapshot_20101016-1-mipsel-4lKiJl/gcc-snapshot-20101016/build/gcc/testsuite/gcc/../../../intl -DIN_GCC -fPIC -shared
UNRESOLVED: start_unit_plugin.c compilation, -I. -I/build/buildd-gcc-snapshot_20101016-1-mipsel-4lKiJl/gcc-snapshot-20101016/src/gcc/testsuite -I/build/buildd-gcc-snapshot_20101016-1-mipsel-4lKiJl/gcc-snapshot-20101016/src/gcc/testsuite/../../gcc -I/build/buildd-gcc-snapshot_20101016-1-mipsel-4lKiJl/gcc-snapshot-20101016/build/gcc/testsuite/gcc/../../../gcc -I/build/buildd-gcc-snapshot_20101016-1-mipsel-4lKiJl/gcc-snapshot-20101016/src/gcc/testsuite/../../include -I/build/buildd-gcc-snapshot_20101016-1-mipsel-4lKiJl/gcc-snapshot-20101016/src/gcc/testsuite/../../libcpp/include -I/build/buildd-gcc-snapshot_20101016-1-mipsel-4lKiJl/gcc-snapshot-20101016/build/gcc/testsuite/gcc/../../../intl -DIN_GCC -fPIC -shared
UNRESOLVED: finish_unit_plugin.c compilation, -I. -I/build/buildd-gcc-snapshot_20101016-1-mipsel-4lKiJl/gcc-snapshot-20101016/src/gcc/testsuite -I/build/buildd-gcc-snapshot_20101016-1-mipsel-4lKiJl/gcc-snapshot-20101016/src/gcc/testsuite/../../gcc -I/build/buildd-gcc-snapshot_20101016-1-mipsel-4lKiJl/gcc-snapshot-20101016/build/gcc/testsuite/gcc/../../../gcc -I/build/buildd-gcc-snapshot_20101016-1-mipsel-4lKiJl/gcc-snapshot-20101016/src/gcc/testsuite/../../include -I/build/buildd-gcc-snapshot_20101016-1-mipsel-4lKiJl/gcc-snapshot-20101016/src/gcc/testsuite/../../libcpp/include -I/build/buildd-gcc-snapshot_20101016-1-mipsel-4lKiJl/gcc-snapshot-20101016/build/gcc/testsuite/gcc/../../../intl -DIN_GCC -fPIC -shared
FAIL: gcc.dg/tree-prof/inliner-1.c scan-tree-dump-not optimized "hot_function ..;"
FAIL: gcc.dg/tree-ssa/vrp51.c scan-assembler-not bug.
FAIL: gcc.misc-tests/linkage.c link
FAIL: gcc.target/mips/dspr2-MULT.c scan-assembler ac2
FAIL: gcc.target/mips/dspr2-MULTU.c scan-assembler ac2
FAIL: gcc.target/mips/mult-1.c scan-assembler dins
FAIL: gcc.target/mips/octeon-bbit-2.c scan-assembler bnel
FAIL: gcc.target/mips/octeon-bbit-2.c scan-assembler-not bne

=== gcc Summary for unix/-mabi=64 ===

# of expected passes 69445
# of unexpected failures 13
# of expected failures 131
# of unresolved testcases 6
# of unsupported tests 887

Running target unix/-mabi=n32
FAIL: gcc.dg/cproj-fails-with-broken-glibc.c execution test
FAIL: gcc.dg/uninit-pred-7_a.c bogus warning (test for bogus messages, line 26)
FAIL: gcc.dg/uninit-pred-8_a.c bogus warning (test for bogus messages, line 26)
FAIL: gcc.dg/fixed-point/composite-type.c (test for excess errors)
UNRESOLVED: selfassign.c compilation, -I. -I/build/buildd-gcc-snapshot_20101016-1-mipsel-4lKiJl/gcc-snapshot-20101016/src/gcc/testsuite -I/build/buildd-gcc-snapshot_20101016-1-mipsel-4lKiJl/gcc-snapshot-20101016/src/gcc/testsuite/../../gcc -I/build/buildd-gcc-snapshot_20101016-1-mipsel-4lKiJl/gcc-snapshot-20101016/build/gcc/testsuite/gcc/../../../gcc -I/build/buildd-gcc-snapshot_20101016-1-mipsel-4lKiJl/gcc-snapshot-20101016/src/gcc/testsuite/../../include -I/build/buildd-gcc-snapshot_20101016-1-mipsel-4lKiJl/gcc-snapshot-20101016/src/gcc/testsuite/../../libcpp/include -I/build/buildd-gcc-snapshot_20101016-1-mipsel-4lKiJl/gcc-snapshot-20101016/build/gcc/testsuite/gcc/../../../intl -O -DIN_GCC -fPIC -shared
UNRESOLVED: ggcplug.c compilation, -I. -I/build/buildd-gcc-snapshot_20101016-1-mipsel-4lKiJl/gcc-snapshot-20101016/src/gcc/testsuite -I/build/buildd-gcc-snapshot_20101016-1-mipsel-4lKiJl/gcc-snapshot-20101016/src/gcc/testsuite/../../gcc -I/build/buildd-gcc-snapshot_20101016-1-mipsel-4lKiJl/gcc-snapshot-20101016/build/gcc/testsuite/gcc/../../../gcc -I/build/buildd-gcc-snapshot_20101016-1-mipsel-4lKiJl/gcc-snapshot-20101016/src/gcc/testsuite/../../include -I/build/buildd-gcc-snapshot_20101016-1-mipsel-4lKiJl/gcc-snapshot-20101016/src/gcc/testsuite/../../libcpp/include -I/build/buildd-gcc-snapshot_20101016-1-mipsel-4lKiJl/gcc-snapshot-20101016/build/gcc/testsuite/gcc/../../../intl -O -DIN_GCC -fPIC -shared
UNRESOLVED: one_time_plugin.c compilation, -I. -I/build/buildd-gcc-snapshot_20101016-1-mipsel-4lKiJl/gcc-snapshot-20101016/src/gcc/testsuite -I/build/buildd-gcc-snapshot_20101016-1-mipsel-4lKiJl/gcc-snapshot-20101016/src/gcc/testsuite/../../gcc -I/build/buildd-gcc-snapshot_20101016-1-mipsel-4lKiJl/gcc-snapshot-20101016/build/gcc/testsuite/gcc/../../../gcc -I/build/buildd-gcc-snapshot_20101016-1-mipsel-4lKiJl/gcc-snapshot-20101016/src/gcc/testsuite/../../include -I/build/buildd-gcc-snapshot_20101016-1-mipsel-4lKiJl/gcc-snapshot-20101016/src/gcc/testsuite/../../libcpp/include -I/build/buildd-gcc-snapshot_20101016-1-mipsel-4lKiJl/gcc-snapshot-20101016/build/gcc/testsuite/gcc/../../../intl -DIN_GCC -fPIC -shared
UNRESOLVED: start_unit_plugin.c compilation, -I. -I/build/buildd-gcc-snapshot_20101016-1-mipsel-4lKiJl/gcc-snapshot-20101016/src/gcc/testsuite -I/build/buildd-gcc-snapshot_20101016-1-mipsel-4lKiJl/gcc-snapshot-20101016/src/gcc/testsuite/../../gcc -I/build/buildd-gcc-snapshot_20101016-1-mipsel-4lKiJl/gcc-snapshot-20101016/build/gcc/testsuite/gcc/../../../gcc -I/build/buildd-gcc-snapshot_20101016-1-mipsel-4lKiJl/gcc-snapshot-20101016/src/gcc/testsuite/../../include -I/build/buildd-gcc-snapshot_20101016-1-mipsel-4lKiJl/gcc-snapshot-20101016/src/gcc/testsuite/../../libcpp/include -I/build/buildd-gcc-snapshot_20101016-1-mipsel-4lKiJl/gcc-snapshot-20101016/build/gcc/testsuite/gcc/../../../intl -DIN_GCC -fPIC -shared
UNRESOLVED: finish_unit_plugin.c compilation, -I. -I/build/buildd-gcc-snapshot_20101016-1-mipsel-4lKiJl/gcc-snapshot-20101016/src/gcc/testsuite -I/build/buildd-gcc-snapshot_20101016-1-mipsel-4lKiJl/gcc-snapshot-20101016/src/gcc/testsuite/../../gcc -I/build/buildd-gcc-snapshot_20101016-1-mipsel-4lKiJl/gcc-snapshot-20101016/build/gcc/testsuite/gcc/../../../gcc -I/build/buildd-gcc-snapshot_20101016-1-mipsel-4lKiJl/gcc-snapshot-20101016/src/gcc/testsuite/../../include -I/build/buildd-gcc-snapshot_20101016-1-mipsel-4lKiJl/gcc-snapshot-20101016/src/gcc/testsuite/../../libcpp/include -I/build/buildd-gcc-snapshot_20101016-1-mipsel-4lKiJl/gcc-snapshot-20101016/build/gcc/testsuite/gcc/../../../intl -DIN_GCC -fPIC -shared
FAIL: gcc.dg/tree-prof/inliner-1.c scan-tree-dump-not optimized "hot_function ..;"
FAIL: gcc.dg/tree-ssa/vrp51.c scan-assembler-not bug.
FAIL: gcc.misc-tests/linkage.c link
FAIL: gcc.target/mips/dspr2-MULT.c scan-assembler ac2
FAIL: gcc.target/mips/dspr2-MULTU.c scan-assembler ac2

=== gcc Summary for unix/-mabi=n32 ===

# of expected passes 69474
# of unexpected failures 9
# of expected failures 130
# of unresolved testcases 5
# of unsupported tests 879

=== gcc Summary ===

# of expected passes 207752
# of unexpected failures 32
# of expected failures 391
# of unresolved testcases 16
# of unsupported tests 2646
/build/buildd-gcc-snapshot_20101016-1-mipsel-4lKiJl/gcc-snapshot-20101016/build/gcc/xgcc version 4.6.0 20101016 (experimental) [trunk revision 165538] (Debian 20101016-1)

=== gfortran tests ===


Running target unix
FAIL: gfortran.dg/pr45636.f90 -O scan-tree-dump-times forwprop2 "memset" 0
FAIL: gfortran.dg/select_type_4.f90 -O2 execution test
FAIL: gfortran.dg/select_type_4.f90 -O3 -fomit-frame-pointer execution test
FAIL: gfortran.dg/select_type_4.f90 -O3 -fomit-frame-pointer -funroll-loops execution test
FAIL: gfortran.dg/select_type_4.f90 -O3 -fomit-frame-pointer -funroll-all-loops -finline-functions execution test
FAIL: gfortran.dg/select_type_4.f90 -O3 -g execution test

=== gfortran Summary for unix ===

# of expected passes 35905
# of unexpected failures 6
# of expected failures 53
# of unsupported tests 355

Running target unix/-mabi=64
FAIL: gfortran.dg/allocatable_scalar_5.f90 -O0 execution test
FAIL: gfortran.dg/pr45636.f90 -O scan-tree-dump-times forwprop2 "memset" 0
FAIL: gfortran.dg/select_type_4.f90 -O2 execution test
FAIL: gfortran.dg/select_type_4.f90 -O3 -fomit-frame-pointer execution test
FAIL: gfortran.dg/select_type_4.f90 -O3 -fomit-frame-pointer -funroll-loops execution test
FAIL: gfortran.dg/select_type_4.f90 -O3 -fomit-frame-pointer -funroll-all-loops -finline-functions execution test
FAIL: gfortran.dg/select_type_4.f90 -O3 -g execution test

=== gfortran Summary for unix/-mabi=64 ===

# of expected passes 36482
# of unexpected failures 7
# of expected failures 51
# of unsupported tests 73

Running target unix/-mabi=n32
XPASS: gfortran.dg/pr25923.f90 -O PR45505 (test for warnings, line 13)
XPASS: gfortran.dg/pr25923.f90 -O PR45505 (test for bogus messages, line 22)
FAIL: gfortran.dg/pr45636.f90 -O scan-tree-dump-times forwprop2 "memset" 0

=== gfortran Summary for unix/-mabi=n32 ===

# of expected passes 36486
# of unexpected failures 1
# of unexpected successes 2
# of expected failures 51
# of unsupported tests 73

=== gfortran Summary ===

# of expected passes 108873
# of unexpected failures 14
# of unexpected successes 2
# of expected failures 155
# of unsupported tests 501
/build/buildd-gcc-snapshot_20101016-1-mipsel-4lKiJl/gcc-snapshot-20101016/build/gcc/testsuite/gfortran/../../gfortran version 4.6.0 20101016 (experimental) [trunk revision 165538] (Debian 20101016-1)

=== gnat tests ===


Running target unix
FAIL: gnat.dg/stack_check1.adb execution test
FAIL: gnat.dg/stack_check2.adb execution test

=== gnat Summary for unix ===

# of expected passes 821
# of unexpected failures 2
# of expected failures 10
# of unsupported tests 6

Running target unix/-mabi=64
UNRESOLVED: gnat.dg/abstract_with_anonymous_result.adb compilation failed to produce executable
UNRESOLVED: gnat.dg/access4.adb compilation failed to produce executable
UNRESOLVED: gnat.dg/access_discr2.adb compilation failed to produce executable
UNRESOLVED: gnat.dg/access_test.adb compilation failed to produce executable
UNRESOLVED: gnat.dg/addr2.adb compilation failed to produce executable
UNRESOLVED: gnat.dg/address_conversion.adb compilation failed to produce executable
UNRESOLVED: gnat.dg/aggr1.adb compilation failed to produce executable
FAIL: gnat.dg/aggr12.adb scan-tree-dump-not original "{.i1=0, .i2=2}": dump file does not exist
FAIL: gnat.dg/aggr13.adb scan-tree-dump-not gimple "= {}": dump file does not exist
UNRESOLVED: gnat.dg/aggr14.adb compilation failed to produce executable
UNRESOLVED: gnat.dg/aggr3.adb compilation failed to produce executable
UNRESOLVED: gnat.dg/aliased_prefix_accessibility.adb compilation failed to produce executable
FAIL: gnat.dg/aliasing1.adb scan-tree-dump-not optimized "__gnat_rcheck": dump file does not exist
FAIL: gnat.dg/aliasing2.adb scan-tree-dump-not optimized "__gnat_rcheck": dump file does not exist
UNRESOLVED: gnat.dg/aliasing3.adb compilation failed to produce executable
UNRESOLVED: gnat.dg/align_check.adb compilation failed to produce executable
UNRESOLVED: gnat.dg/align_max.adb compilation failed to produce executable
UNRESOLVED: gnat.dg/aligned_vla.adb compilation failed to produce executable
UNRESOLVED: gnat.dg/alignment1.adb compilation failed to produce executable
UNRESOLVED: gnat.dg/alignment2.adb compilation failed to produce executable
FAIL: gnat.dg/alignment4.adb scan-tree-dump-not gimple ".F": dump file does not exist
FAIL: gnat.dg/alignment5.adb scan-tree-dump-not gimple ".F": dump file does not exist
FAIL: gnat.dg/alignment6.adb scan-tree-dump-not gimple "VIEW_CONVERT_EXPR": dump file does not exist
UNRESOLVED: gnat.dg/alignment7.adb compilation failed to produce executable
UNRESOLVED: gnat.dg/alignment8.adb compilation failed to produce executable
UNRESOLVED: gnat.dg/alignment9.adb compilation failed to produce executable
UNRESOLVED: gnat.dg/allocator_maxalign1.adb compilation failed to produce executable
FAIL: gnat.dg/ancestor_type.adb (test for errors, line 8)
UNRESOLVED: gnat.dg/array10.adb compilation failed to produce executable
FAIL: gnat.dg/array11.adb (test for warnings, line 8)
FAIL: gnat.dg/array11.adb (test for warnings, line 9)
FAIL: gnat.dg/array11.adb (test for warnings, line 12)
UNRESOLVED: gnat.dg/array12.adb compilation failed to produce executable
UNRESOLVED: gnat.dg/array3.adb compilation failed to produce executable
UNRESOLVED: gnat.dg/array4.adb compilation failed to produce executable
UNRESOLVED: gnat.dg/array5.adb compilation failed to produce executable
UNRESOLVED: gnat.dg/array6.adb compilation failed to produce executable
UNRESOLVED: gnat.dg/array9.adb compilation failed to produce executable
UNRESOLVED: gnat.dg/array_bounds_test.adb compilation failed to produce executable
UNRESOLVED: gnat.dg/assert1.adb compilation failed to produce executable
UNRESOLVED: gnat.dg/assign_from_packed.adb compilation failed to produce executable
FAIL: gnat.dg/atomic2.adb (test for warnings, line 7)
UNRESOLVED: gnat.dg/biased_uc.adb compilation failed to produce executable
UNRESOLVED: gnat.dg/bip_aggregate_bug.adb compilation failed to produce executable
UNRESOLVED: gnat.dg/bit_packed_array3.adb compilation failed to produce executable
UNRESOLVED: gnat.dg/blkextract_from_reg.adb compilation failed to produce executable
UNRESOLVED: gnat.dg/bltins.adb compilation failed to produce executable
UNRESOLVED: gnat.dg/boolean_bitfield.adb compilation failed to produce executable
UNRESOLVED: gnat.dg/boolean_expr2.adb compilation failed to produce executable
UNRESOLVED: gnat.dg/capture_value.adb compilation failed to produce executable
UNRESOLVED: gnat.dg/case_optimization2.adb compilation failed to produce executable
UNRESOLVED: gnat.dg/check_displace_generation.adb compilation failed to produce executable
UNRESOLVED: gnat.dg/check_elaboration_code.adb compilation failed to produce executable
UNRESOLVED: gnat.dg/compose.adb compilation failed to produce executable
UNRESOLVED: gnat.dg/concat1.adb compilation failed to produce executable
UNRESOLVED: gnat.dg/concat_length.adb compilation failed to produce executable
UNRESOLVED: gnat.dg/constant2.adb compilation failed to produce executable
UNRESOLVED: gnat.dg/controlled5.adb compilation failed to produce executable
UNRESOLVED: gnat.dg/conv_bug.adb compilation failed to produce executable
UNRESOLVED: gnat.dg/conv_decimal.adb compilation failed to produce executable
UNRESOLVED: gnat.dg/conv_real.adb compilation failed to produce executable
UNRESOLVED: gnat.dg/curr_task.adb compilation failed to produce executable
FAIL: gnat.dg/deferred_const1.adb (test for warnings, line 8)
UNRESOLVED: gnat.dg/deferred_const2.adb compilation failed to produce executable
UNRESOLVED: gnat.dg/deferred_const3.adb compilation failed to produce executable
UNRESOLVED: gnat.dg/derived_aggregate.adb compilation failed to produce executable
FAIL: gnat.dg/derived_type1.adb scan-tree-dump-not original "VIEW_CONVERT_EXPR<struct derived_type1__root>": dump file does not exist
FAIL: gnat.dg/derived_type1.adb scan-tree-dump-not original "VIEW_CONVERT_EXPR<struct derived_type1__derived1>": dump file does not exist
UNRESOLVED: gnat.dg/discr24.adb compilation failed to produce executable
UNRESOLVED: gnat.dg/discr4.adb compilation failed to produce executable
UNRESOLVED: gnat.dg/dispatch1.adb compilation failed to produce executable
UNRESOLVED: gnat.dg/dispatch2.adb compilation failed to produce executable
UNRESOLVED: gnat.dg/elim2.adb compilation failed to produce executable
UNRESOLVED: gnat.dg/empty_vector_length.adb compilation failed to produce executable
UNRESOLVED: gnat.dg/entry_queues.adb compilation failed to produce executable
UNRESOLVED: gnat.dg/enum1.adb compilation failed to produce executable
UNRESOLVED: gnat.dg/enum2.adb compilation failed to produce executable
UNRESOLVED: gnat.dg/exp0_eval.adb compilation failed to produce executable
UNRESOLVED: gnat.dg/expect1.adb compilation failed to produce executable
UNRESOLVED: gnat.dg/fixce.adb compilation failed to produce executable
UNRESOLVED: gnat.dg/fixedpnt.adb compilation failed to produce executable
FAIL: gnat.dg/frame_overflow.adb (test for errors, line 17)
FAIL: gnat.dg/frame_overflow.adb (test for errors, line 24)
UNRESOLVED: gnat.dg/generic_dispatch.adb compilation failed to produce executable
UNRESOLVED: gnat.dg/gnat_malloc.adb compilation failed to produce executable
UNRESOLVED: gnat.dg/handle_and_return.adb compilation failed to produce executable
UNRESOLVED: gnat.dg/handle_raise_from_pure.adb compilation failed to produce executable
UNRESOLVED: gnat.dg/hyper_flat.adb compilation failed to produce executable
UNRESOLVED: gnat.dg/in_out_parameter.adb compilation failed to produce executable
XPASS: gnat.dg/incomplete2.adb (test for excess errors)
UNRESOLVED: gnat.dg/init_scalar1.adb compilation failed to produce executable
UNRESOLVED: gnat.dg/inline_tagged.adb compilation failed to produce executable
UNRESOLVED: gnat.dg/interface1.adb compilation failed to produce executable
UNRESOLVED: gnat.dg/interface2.adb compilation failed to produce executable
UNRESOLVED: gnat.dg/interface3.adb compilation failed to produce executable
UNRESOLVED: gnat.dg/interface_conv.adb compilation failed to produce executable
UNRESOLVED: gnat.dg/iprot_test.adb compilation failed to produce executable
UNRESOLVED: gnat.dg/kill_value.adb compilation failed to produce executable
UNRESOLVED: gnat.dg/lhs_view_convert.adb compilation failed to produce executable
UNRESOLVED: gnat.dg/loop_boolean.adb compilation failed to produce executable
UNRESOLVED: gnat.dg/loop_optimization3.adb compilation failed to produce executable
UNRESOLVED: gnat.dg/loop_optimization4.adb compilation failed to produce executable
UNRESOLVED: gnat.dg/lto1.adb compilation failed to produce executable
UNRESOLVED: gnat.dg/lto10.adb compilation failed to produce executable
UNRESOLVED: gnat.dg/lto5.adb compilation failed to produce executable
UNRESOLVED: gnat.dg/lto6.adb compilation failed to produce executable
UNRESOLVED: gnat.dg/lto7.adb compilation failed to produce executable
UNRESOLVED: gnat.dg/lto8.adb compilation failed to produce executable
UNRESOLVED: gnat.dg/lto9.adb compilation failed to produce executable
UNRESOLVED: gnat.dg/md5_test.adb compilation failed to produce executable
ERROR: gnat.dg/memtrap.adb: error executing dg-final: couldn't open "memtrap.s": no such file or directory
UNRESOLVED: gnat.dg/memtrap.adb: error executing dg-final: couldn't open "memtrap.s": no such file or directory
UNRESOLVED: gnat.dg/misaligned_nest.adb compilation failed to produce executable
UNRESOLVED: gnat.dg/misaligned_param.adb compilation failed to produce executable
UNRESOLVED: gnat.dg/missing_acc_check.adb compilation failed to produce executable
UNRESOLVED: gnat.dg/modular1.adb compilation failed to produce executable
UNRESOLVED: gnat.dg/modular2.adb compilation failed to produce executable
UNRESOLVED: gnat.dg/modular3.adb compilation failed to produce executable
UNRESOLVED: gnat.dg/mutable1.adb compilation failed to produce executable
UNRESOLVED: gnat.dg/named_test.adb compilation failed to produce executable
UNRESOLVED: gnat.dg/nat1r.adb compilation failed to produce executable
UNRESOLVED: gnat.dg/nested_controlled_alloc.adb compilation failed to produce executable
UNRESOLVED: gnat.dg/nested_proc1.adb compilation failed to produce executable
UNRESOLVED: gnat.dg/nested_return_test.adb compilation failed to produce executable
UNRESOLVED: gnat.dg/no_final.adb compilation failed to produce executable
UNRESOLVED: gnat.dg/not_null.adb compilation failed to produce executable
FAIL: gnat.dg/notnot.adb (test for warnings, line 6)
UNRESOLVED: gnat.dg/null_pointer_deref1.adb compilation failed to produce executable
UNRESOLVED: gnat.dg/null_pointer_deref2.adb compilation failed to produce executable
FAIL: gnat.dg/object_overflow.adb (test for warnings, line 8)
ERROR: gnat.dg/oconst1.adb: error executing dg-final: couldn't open "oconst1.s": no such file or directory
UNRESOLVED: gnat.dg/oconst1.adb: error executing dg-final: couldn't open "oconst1.s": no such file or directory
ERROR: gnat.dg/oconst2.adb: error executing dg-final: couldn't open "oconst2.s": no such file or directory
UNRESOLVED: gnat.dg/oconst2.adb: error executing dg-final: couldn't open "oconst2.s": no such file or directory
ERROR: gnat.dg/oconst3.adb: error executing dg-final: couldn't open "oconst3.s": no such file or directory
UNRESOLVED: gnat.dg/oconst3.adb: error executing dg-final: couldn't open "oconst3.s": no such file or directory
ERROR: gnat.dg/oconst4.adb: error executing dg-final: couldn't open "oconst4.s": no such file or directory
UNRESOLVED: gnat.dg/oconst4.adb: error executing dg-final: couldn't open "oconst4.s": no such file or directory
ERROR: gnat.dg/oconst5.adb: error executing dg-final: couldn't open "oconst5.s": no such file or directory
UNRESOLVED: gnat.dg/oconst5.adb: error executing dg-final: couldn't open "oconst5.s": no such file or directory
FAIL: gnat.dg/old_errors.adb (test for errors, line 7)
FAIL: gnat.dg/old_errors.adb (test for errors, line 16)
FAIL: gnat.dg/old_errors.adb (test for errors, line 28)
FAIL: gnat.dg/old_errors.adb (test for errors, line 34)
FAIL: gnat.dg/old_errors.adb (test for errors, line 38)
FAIL: gnat.dg/old_errors.adb (test for warnings, line 40)
FAIL: gnat.dg/old_errors.adb (test for errors, line 44)
UNRESOLVED: gnat.dg/opt2.adb compilation failed to produce executable
UNRESOLVED: gnat.dg/opt4.adb compilation failed to produce executable
UNRESOLVED: gnat.dg/opt5.adb compilation failed to produce executable
UNRESOLVED: gnat.dg/outer_agg_bitfield_constructor.adb compilation failed to produce executable
UNRESOLVED: gnat.dg/overflow_sum.adb compilation failed to produce executable
UNRESOLVED: gnat.dg/pack10.adb compilation failed to produce executable
UNRESOLVED: gnat.dg/pack11.adb compilation failed to produce executable
UNRESOLVED: gnat.dg/pack12.adb compilation failed to produce executable
UNRESOLVED: gnat.dg/pack3.adb compilation failed to produce executable
UNRESOLVED: gnat.dg/pack4.adb compilation failed to produce executable
FAIL: gnat.dg/pack8.adb (test for errors, line 19)
FAIL: gnat.dg/pack9.adb scan-tree-dump-not optimized "__gnat_rcheck": dump file does not exist
UNRESOLVED: gnat.dg/packed_subtype.adb compilation failed to produce executable
UNRESOLVED: gnat.dg/pointer_conversion.adb compilation failed to produce executable
UNRESOLVED: gnat.dg/prot_def.adb compilation failed to produce executable
UNRESOLVED: gnat.dg/protected_self_ref1.adb compilation failed to produce executable
FAIL: gnat.dg/protected_self_ref2.adb (test for errors, line 12)
UNRESOLVED: gnat.dg/quote.adb compilation failed to produce executable
UNRESOLVED: gnat.dg/range_check.adb compilation failed to produce executable
UNRESOLVED: gnat.dg/regpat1.adb compilation failed to produce executable
UNRESOLVED: gnat.dg/release_unc_maxalign.adb compilation failed to produce executable
UNRESOLVED: gnat.dg/renaming2.adb compilation failed to produce executable
UNRESOLVED: gnat.dg/renaming3.adb compilation failed to produce executable
UNRESOLVED: gnat.dg/rep_clause4.adb compilation failed to produce executable
UNRESOLVED: gnat.dg/requeue1.adb compilation failed to produce executable
UNRESOLVED: gnat.dg/scalar_mode_agg_compare.adb compilation failed to produce executable
UNRESOLVED: gnat.dg/self_aggregate_with_array.adb compilation failed to produce executable
UNRESOLVED: gnat.dg/self_aggregate_with_call.adb compilation failed to produce executable
UNRESOLVED: gnat.dg/self_aggregate_with_pointer.adb compilation failed to produce executable
UNRESOLVED: gnat.dg/self_aggregate_with_zeros.adb compilation failed to produce executable
UNRESOLVED: gnat.dg/sizetype1.adb compilation failed to produce executable
UNRESOLVED: gnat.dg/sizetype2.adb compilation failed to produce executable
UNRESOLVED: gnat.dg/slice3.adb compilation failed to produce executable
UNRESOLVED: gnat.dg/slice4.adb compilation failed to produce executable
FAIL: gnat.dg/slice5.adb (test for warnings, line 15)
FAIL: gnat.dg/slice5.adb (test for warnings, line 21)
UNRESOLVED: gnat.dg/small_alignment.adb compilation failed to produce executable
UNRESOLVED: gnat.dg/socket1.adb compilation failed to produce executable
UNRESOLVED: gnat.dg/sort2.adb compilation failed to produce executable
UNRESOLVED: gnat.dg/spipaterr.adb compilation failed to produce executable
UNRESOLVED: gnat.dg/stack_check1.adb compilation failed to produce executable
UNRESOLVED: gnat.dg/stack_check2.adb compilation failed to produce executable
UNRESOLVED: gnat.dg/string_slice.adb compilation failed to produce executable
FAIL: gnat.dg/subp_elim_errors.adb (test for errors, line 25)
FAIL: gnat.dg/subp_elim_errors.adb (test for errors, line 27)
FAIL: gnat.dg/subp_elim_errors.adb (test for errors, line 29)
FAIL: gnat.dg/subp_elim_errors.adb (test for errors, line 31)
UNRESOLVED: gnat.dg/tag1.adb compilation failed to produce executable
UNRESOLVED: gnat.dg/tagged_alloc_free.adb compilation failed to produce executable
UNRESOLVED: gnat.dg/tail_call.adb compilation failed to produce executable
UNRESOLVED: gnat.dg/task_stack_align.adb compilation failed to produce executable
UNRESOLVED: gnat.dg/test_8bitlong_overflow.adb compilation failed to produce executable
UNRESOLVED: gnat.dg/test_address_null_init.adb compilation failed to produce executable
UNRESOLVED: gnat.dg/test_allocator_maxalign2.adb compilation failed to produce executable
UNRESOLVED: gnat.dg/test_bounded.adb compilation failed to produce executable
UNRESOLVED: gnat.dg/test_delay.adb compilation failed to produce executable
UNRESOLVED: gnat.dg/test_direct_io.adb compilation failed to produce executable
UNRESOLVED: gnat.dg/test_enum_io.adb compilation failed to produce executable
UNRESOLVED: gnat.dg/test_fixed_io.adb compilation failed to produce executable
UNRESOLVED: gnat.dg/test_iface_aggr.adb compilation failed to produce executable
UNRESOLVED: gnat.dg/test_ifaces.adb compilation failed to produce executable
UNRESOLVED: gnat.dg/test_image.adb compilation failed to produce executable
UNRESOLVED: gnat.dg/test_nested_subtype_byref.adb compilation failed to produce executable
UNRESOLVED: gnat.dg/test_oalign.adb compilation failed to produce executable
UNRESOLVED: gnat.dg/test_oconst.adb compilation failed to produce executable
UNRESOLVED: gnat.dg/test_prefix1.adb compilation failed to produce executable
UNRESOLVED: gnat.dg/test_prio.adb compilation failed to produce executable
UNRESOLVED: gnat.dg/test_raise_from_pure.adb compilation failed to produce executable
UNRESOLVED: gnat.dg/test_self.adb compilation failed to produce executable
UNRESOLVED: gnat.dg/test_self_ref.adb compilation failed to produce executable
UNRESOLVED: gnat.dg/test_table1.adb compilation failed to produce executable
UNRESOLVED: gnat.dg/test_tamdt.adb compilation failed to produce executable
UNRESOLVED: gnat.dg/test_time_stamp.adb compilation failed to produce executable
UNRESOLVED: gnat.dg/test_version.adb compilation failed to produce executable
UNRESOLVED: gnat.dg/testint.adb compilation failed to produce executable
UNRESOLVED: gnat.dg/tfren.adb compilation failed to produce executable
UNRESOLVED: gnat.dg/thin_pointer2.adb compilation failed to produce executable
UNRESOLVED: gnat.dg/timer_cancel.adb compilation failed to produce executable
UNRESOLVED: gnat.dg/timing_events.adb compilation failed to produce executable
ERROR: gnat.dg/trampoline1.adb: error executing dg-final: couldn't open "trampoline1.s": no such file or directory
UNRESOLVED: gnat.dg/trampoline1.adb: error executing dg-final: couldn't open "trampoline1.s": no such file or directory
UNRESOLVED: gnat.dg/trampoline2.adb compilation failed to produce executable
UNRESOLVED: gnat.dg/tree_static_use.adb compilation failed to produce executable
UNRESOLVED: gnat.dg/unc_memfree.adb compilation failed to produce executable
UNRESOLVED: gnat.dg/unchecked_convert1.adb compilation failed to produce executable
UNRESOLVED: gnat.dg/unchecked_convert2.adb compilation failed to produce executable
UNRESOLVED: gnat.dg/unchecked_convert3.adb compilation failed to produce executable
UNRESOLVED: gnat.dg/unchecked_union1.adb compilation failed to produce executable
FAIL: gnat.dg/uninit_func.adb (test for warnings, line 5)
UNRESOLVED: gnat.dg/valid1.adb compilation failed to produce executable
ERROR: gnat.dg/volatile3.adb: error executing dg-final: couldn't open "volatile3.s": no such file or directory
UNRESOLVED: gnat.dg/volatile3.adb: error executing dg-final: couldn't open "volatile3.s": no such file or directory
UNRESOLVED: gnat.dg/warn1.adb compilation failed to produce executable
FAIL: gnat.dg/warn4.adb (test for warnings, line 14)
FAIL: gnat.dg/warn4.adb (test for warnings, line 14)
FAIL: gnat.dg/warn5.adb (test for warnings, line 29)
UNRESOLVED: gnat.dg/wide_boolean.adb compilation failed to produce executable
UNRESOLVED: gnat.dg/wide_test.adb compilation failed to produce executable
FAIL: gnat.dg/specs/abstract_private.ads (test for errors, line 12)
FAIL: gnat.dg/specs/access_constant.ads (test for errors, line 10)
FAIL: gnat.dg/specs/access_constant_decl.ads (test for errors, line 9)
FAIL: gnat.dg/specs/addr1.ads (test for warnings, line 30)
FAIL: gnat.dg/specs/alignment2.ads (test for warnings, line 12)
FAIL: gnat.dg/specs/alignment2.ads (test for warnings, line 18)
FAIL: gnat.dg/specs/alignment2.ads (test for warnings, line 36)
FAIL: gnat.dg/specs/alignment2.ads (test for warnings, line 40)
XPASS: gnat.dg/specs/controlled1_pkg.ads (test for excess errors)
XPASS: gnat.dg/specs/fe_inlining_helper.ads (test for excess errors)
FAIL: gnat.dg/specs/import_abstract.ads (test for errors, line 5)
FAIL: gnat.dg/specs/integer_value.ads (test for errors, line 4)
FAIL: gnat.dg/specs/linker_section.ads (test for errors, line 6)
FAIL: gnat.dg/specs/linker_section.ads (test for errors, line 10)
XPASS: gnat.dg/specs/lto3_pkg1.ads (test for excess errors)
XPASS: gnat.dg/specs/lto3_pkg2.ads (test for excess errors)
FAIL: gnat.dg/specs/oversize.ads (test for errors, line 18)
FAIL: gnat.dg/specs/oversize.ads (test for errors, line 25)
FAIL: gnat.dg/specs/oversize.ads (test for errors, line 33)
FAIL: gnat.dg/specs/oversize.ads (test for errors, line 44)
XPASS: gnat.dg/specs/pack3_pkg.ads (test for excess errors)
FAIL: gnat.dg/specs/renamings.ads (test for errors, line 9)
FAIL: gnat.dg/specs/renamings.ads (test for errors, line 13)
XPASS: gnat.dg/specs/size_attribute1_pkg1.ads (test for excess errors)
XPASS: gnat.dg/specs/size_attribute1_pkg2.ads (test for excess errors)
FAIL: gnat.dg/specs/size_clause2.ads (test for errors, line 40)
FAIL: gnat.dg/specs/size_clause3.ads (test for errors, line 17)
FAIL: gnat.dg/specs/size_clause3.ads (test for errors, line 47)
ERROR: gnat.dg/specs/static_initializer.ads: error executing dg-final: couldn't open "static_initializer.s": no such file or directory
UNRESOLVED: gnat.dg/specs/static_initializer.ads: error executing dg-final: couldn't open "static_initializer.s": no such file or directory
ERROR: gnat.dg/specs/static_initializer2.ads: error executing dg-final: couldn't open "static_initializer2.s": no such file or directory
UNRESOLVED: gnat.dg/specs/static_initializer2.ads: error executing dg-final: couldn't open "static_initializer2.s": no such file or directory
FAIL: gnat.dg/specs/storage.ads (test for errors, line 6)
FAIL: gnat.dg/specs/tag2.ads (test for errors, line 11)
FAIL: gnat.dg/specs/tag2.ads (test for errors, line 12)
FAIL: gnat.dg/specs/tag2.ads (test for errors, line 13)
FAIL: gnat.dg/specs/variant_part.ads (test for errors, line 4)
XPASS: gnat.dg/specs/varsize_return_pkg1.ads (test for excess errors)
XPASS: gnat.dg/specs/varsize_return_pkg2.ads (test for excess errors)

=== gnat Summary for unix/-mabi=64 ===

# of expected passes 559
# of unexpected failures 65
# of unexpected successes 10
# of unresolved testcases 199
# of unsupported tests 6

Running target unix/-mabi=n32
UNRESOLVED: gnat.dg/abstract_with_anonymous_result.adb compilation failed to produce executable
UNRESOLVED: gnat.dg/access4.adb compilation failed to produce executable
UNRESOLVED: gnat.dg/access_discr2.adb compilation failed to produce executable
UNRESOLVED: gnat.dg/access_test.adb compilation failed to produce executable
UNRESOLVED: gnat.dg/addr2.adb compilation failed to produce executable
UNRESOLVED: gnat.dg/address_conversion.adb compilation failed to produce executable
UNRESOLVED: gnat.dg/aggr1.adb compilation failed to produce executable
FAIL: gnat.dg/aggr12.adb scan-tree-dump-not original "{.i1=0, .i2=2}": dump file does not exist
FAIL: gnat.dg/aggr13.adb scan-tree-dump-not gimple "= {}": dump file does not exist
UNRESOLVED: gnat.dg/aggr14.adb compilation failed to produce executable
UNRESOLVED: gnat.dg/aggr3.adb compilation failed to produce executable
UNRESOLVED: gnat.dg/aliased_prefix_accessibility.adb compilation failed to produce executable
FAIL: gnat.dg/aliasing1.adb scan-tree-dump-not optimized "__gnat_rcheck": dump file does not exist
FAIL: gnat.dg/aliasing2.adb scan-tree-dump-not optimized "__gnat_rcheck": dump file does not exist
UNRESOLVED: gnat.dg/aliasing3.adb compilation failed to produce executable
UNRESOLVED: gnat.dg/align_check.adb compilation failed to produce executable
UNRESOLVED: gnat.dg/align_max.adb compilation failed to produce executable
UNRESOLVED: gnat.dg/aligned_vla.adb compilation failed to produce executable
UNRESOLVED: gnat.dg/alignment1.adb compilation failed to produce executable
UNRESOLVED: gnat.dg/alignment2.adb compilation failed to produce executable
FAIL: gnat.dg/alignment4.adb scan-tree-dump-not gimple ".F": dump file does not exist
FAIL: gnat.dg/alignment5.adb scan-tree-dump-not gimple ".F": dump file does not exist
FAIL: gnat.dg/alignment6.adb scan-tree-dump-not gimple "VIEW_CONVERT_EXPR": dump file does not exist
UNRESOLVED: gnat.dg/alignment7.adb compilation failed to produce executable
UNRESOLVED: gnat.dg/alignment8.adb compilation failed to produce executable
UNRESOLVED: gnat.dg/alignment9.adb compilation failed to produce executable
UNRESOLVED: gnat.dg/allocator_maxalign1.adb compilation failed to produce executable
FAIL: gnat.dg/ancestor_type.adb (test for errors, line 8)
UNRESOLVED: gnat.dg/array10.adb compilation failed to produce executable
FAIL: gnat.dg/array11.adb (test for warnings, line 8)
FAIL: gnat.dg/array11.adb (test for warnings, line 9)
FAIL: gnat.dg/array11.adb (test for warnings, line 12)
UNRESOLVED: gnat.dg/array12.adb compilation failed to produce executable
UNRESOLVED: gnat.dg/array3.adb compilation failed to produce executable
UNRESOLVED: gnat.dg/array4.adb compilation failed to produce executable
UNRESOLVED: gnat.dg/array5.adb compilation failed to produce executable
UNRESOLVED: gnat.dg/array6.adb compilation failed to produce executable
UNRESOLVED: gnat.dg/array9.adb compilation failed to produce executable
UNRESOLVED: gnat.dg/array_bounds_test.adb compilation failed to produce executable
UNRESOLVED: gnat.dg/assert1.adb compilation failed to produce executable
UNRESOLVED: gnat.dg/assign_from_packed.adb compilation failed to produce executable
FAIL: gnat.dg/atomic2.adb (test for warnings, line 7)
UNRESOLVED: gnat.dg/biased_uc.adb compilation failed to produce executable
UNRESOLVED: gnat.dg/bip_aggregate_bug.adb compilation failed to produce executable
UNRESOLVED: gnat.dg/bit_packed_array3.adb compilation failed to produce executable
UNRESOLVED: gnat.dg/blkextract_from_reg.adb compilation failed to produce executable
UNRESOLVED: gnat.dg/bltins.adb compilation failed to produce executable
UNRESOLVED: gnat.dg/boolean_bitfield.adb compilation failed to produce executable
UNRESOLVED: gnat.dg/boolean_expr2.adb compilation failed to produce executable
UNRESOLVED: gnat.dg/capture_value.adb compilation failed to produce executable
UNRESOLVED: gnat.dg/case_optimization2.adb compilation failed to produce executable
UNRESOLVED: gnat.dg/check_displace_generation.adb compilation failed to produce executable
UNRESOLVED: gnat.dg/check_elaboration_code.adb compilation failed to produce executable
UNRESOLVED: gnat.dg/compose.adb compilation failed to produce executable
UNRESOLVED: gnat.dg/concat1.adb compilation failed to produce executable
UNRESOLVED: gnat.dg/concat_length.adb compilation failed to produce executable
UNRESOLVED: gnat.dg/constant2.adb compilation failed to produce executable
UNRESOLVED: gnat.dg/controlled5.adb compilation failed to produce executable
UNRESOLVED: gnat.dg/conv_bug.adb compilation failed to produce executable
UNRESOLVED: gnat.dg/conv_decimal.adb compilation failed to produce executable
UNRESOLVED: gnat.dg/conv_real.adb compilation failed to produce executable
UNRESOLVED: gnat.dg/curr_task.adb compilation failed to produce executable
FAIL: gnat.dg/deferred_const1.adb (test for warnings, line 8)
UNRESOLVED: gnat.dg/deferred_const2.adb compilation failed to produce executable
UNRESOLVED: gnat.dg/deferred_const3.adb compilation failed to produce executable
UNRESOLVED: gnat.dg/derived_aggregate.adb compilation failed to produce executable
FAIL: gnat.dg/derived_type1.adb scan-tree-dump-not original "VIEW_CONVERT_EXPR<struct derived_type1__root>": dump file does not exist
FAIL: gnat.dg/derived_type1.adb scan-tree-dump-not original "VIEW_CONVERT_EXPR<struct derived_type1__derived1>": dump file does not exist
UNRESOLVED: gnat.dg/discr24.adb compilation failed to produce executable
UNRESOLVED: gnat.dg/discr4.adb compilation failed to produce executable
UNRESOLVED: gnat.dg/dispatch1.adb compilation failed to produce executable
UNRESOLVED: gnat.dg/dispatch2.adb compilation failed to produce executable
UNRESOLVED: gnat.dg/elim2.adb compilation failed to produce executable
UNRESOLVED: gnat.dg/empty_vector_length.adb compilation failed to produce executable
UNRESOLVED: gnat.dg/entry_queues.adb compilation failed to produce executable
UNRESOLVED: gnat.dg/enum1.adb compilation failed to produce executable
UNRESOLVED: gnat.dg/enum2.adb compilation failed to produce executable
UNRESOLVED: gnat.dg/exp0_eval.adb compilation failed to produce executable
UNRESOLVED: gnat.dg/expect1.adb compilation failed to produce executable
UNRESOLVED: gnat.dg/fixce.adb compilation failed to produce executable
UNRESOLVED: gnat.dg/fixedpnt.adb compilation failed to produce executable
FAIL: gnat.dg/frame_overflow.adb (test for errors, line 17)
FAIL: gnat.dg/frame_overflow.adb (test for errors, line 24)
UNRESOLVED: gnat.dg/generic_dispatch.adb compilation failed to produce executable
UNRESOLVED: gnat.dg/gnat_malloc.adb compilation failed to produce executable
UNRESOLVED: gnat.dg/handle_and_return.adb compilation failed to produce executable
UNRESOLVED: gnat.dg/handle_raise_from_pure.adb compilation failed to produce executable
UNRESOLVED: gnat.dg/hyper_flat.adb compilation failed to produce executable
UNRESOLVED: gnat.dg/in_out_parameter.adb compilation failed to produce executable
XPASS: gnat.dg/incomplete2.adb (test for excess errors)
UNRESOLVED: gnat.dg/init_scalar1.adb compilation failed to produce executable
UNRESOLVED: gnat.dg/inline_tagged.adb compilation failed to produce executable
UNRESOLVED: gnat.dg/interface1.adb compilation failed to produce executable
UNRESOLVED: gnat.dg/interface2.adb compilation failed to produce executable
UNRESOLVED: gnat.dg/interface3.adb compilation failed to produce executable
UNRESOLVED: gnat.dg/interface_conv.adb compilation failed to produce executable
UNRESOLVED: gnat.dg/iprot_test.adb compilation failed to produce executable
UNRESOLVED: gnat.dg/kill_value.adb compilation failed to produce executable
UNRESOLVED: gnat.dg/lhs_view_convert.adb compilation failed to produce executable
UNRESOLVED: gnat.dg/loop_boolean.adb compilation failed to produce executable
UNRESOLVED: gnat.dg/loop_optimization3.adb compilation failed to produce executable
UNRESOLVED: gnat.dg/loop_optimization4.adb compilation failed to produce executable
UNRESOLVED: gnat.dg/lto1.adb compilation failed to produce executable
UNRESOLVED: gnat.dg/lto10.adb compilation failed to produce executable
UNRESOLVED: gnat.dg/lto5.adb compilation failed to produce executable
UNRESOLVED: gnat.dg/lto6.adb compilation failed to produce executable
UNRESOLVED: gnat.dg/lto7.adb compilation failed to produce executable
UNRESOLVED: gnat.dg/lto8.adb compilation failed to produce executable
UNRESOLVED: gnat.dg/lto9.adb compilation failed to produce executable
UNRESOLVED: gnat.dg/md5_test.adb compilation failed to produce executable
ERROR: gnat.dg/memtrap.adb: error executing dg-final: couldn't open "memtrap.s": no such file or directory
UNRESOLVED: gnat.dg/memtrap.adb: error executing dg-final: couldn't open "memtrap.s": no such file or directory
UNRESOLVED: gnat.dg/misaligned_nest.adb compilation failed to produce executable
UNRESOLVED: gnat.dg/misaligned_param.adb compilation failed to produce executable
UNRESOLVED: gnat.dg/missing_acc_check.adb compilation failed to produce executable
UNRESOLVED: gnat.dg/modular1.adb compilation failed to produce executable
UNRESOLVED: gnat.dg/modular2.adb compilation failed to produce executable
UNRESOLVED: gnat.dg/modular3.adb compilation failed to produce executable
UNRESOLVED: gnat.dg/mutable1.adb compilation failed to produce executable
UNRESOLVED: gnat.dg/named_test.adb compilation failed to produce executable
UNRESOLVED: gnat.dg/nat1r.adb compilation failed to produce executable
UNRESOLVED: gnat.dg/nested_controlled_alloc.adb compilation failed to produce executable
UNRESOLVED: gnat.dg/nested_proc1.adb compilation failed to produce executable
UNRESOLVED: gnat.dg/nested_return_test.adb compilation failed to produce executable
UNRESOLVED: gnat.dg/no_final.adb compilation failed to produce executable
UNRESOLVED: gnat.dg/not_null.adb compilation failed to produce executable
FAIL: gnat.dg/notnot.adb (test for warnings, line 6)
UNRESOLVED: gnat.dg/null_pointer_deref1.adb compilation failed to produce executable
UNRESOLVED: gnat.dg/null_pointer_deref2.adb compilation failed to produce executable
FAIL: gnat.dg/object_overflow.adb (test for warnings, line 8)
ERROR: gnat.dg/oconst1.adb: error executing dg-final: couldn't open "oconst1.s": no such file or directory
UNRESOLVED: gnat.dg/oconst1.adb: error executing dg-final: couldn't open "oconst1.s": no such file or directory
ERROR: gnat.dg/oconst2.adb: error executing dg-final: couldn't open "oconst2.s": no such file or directory
UNRESOLVED: gnat.dg/oconst2.adb: error executing dg-final: couldn't open "oconst2.s": no such file or directory
ERROR: gnat.dg/oconst3.adb: error executing dg-final: couldn't open "oconst3.s": no such file or directory
UNRESOLVED: gnat.dg/oconst3.adb: error executing dg-final: couldn't open "oconst3.s": no such file or directory
ERROR: gnat.dg/oconst4.adb: error executing dg-final: couldn't open "oconst4.s": no such file or directory
UNRESOLVED: gnat.dg/oconst4.adb: error executing dg-final: couldn't open "oconst4.s": no such file or directory
ERROR: gnat.dg/oconst5.adb: error executing dg-final: couldn't open "oconst5.s": no such file or directory
UNRESOLVED: gnat.dg/oconst5.adb: error executing dg-final: couldn't open "oconst5.s": no such file or directory
FAIL: gnat.dg/old_errors.adb (test for errors, line 7)
FAIL: gnat.dg/old_errors.adb (test for errors, line 16)
FAIL: gnat.dg/old_errors.adb (test for errors, line 28)
FAIL: gnat.dg/old_errors.adb (test for errors, line 34)
FAIL: gnat.dg/old_errors.adb (test for errors, line 38)
FAIL: gnat.dg/old_errors.adb (test for warnings, line 40)
FAIL: gnat.dg/old_errors.adb (test for errors, line 44)
UNRESOLVED: gnat.dg/opt2.adb compilation failed to produce executable
UNRESOLVED: gnat.dg/opt4.adb compilation failed to produce executable
UNRESOLVED: gnat.dg/opt5.adb compilation failed to produce executable
UNRESOLVED: gnat.dg/outer_agg_bitfield_constructor.adb compilation failed to produce executable
UNRESOLVED: gnat.dg/overflow_sum.adb compilation failed to produce executable
UNRESOLVED: gnat.dg/pack10.adb compilation failed to produce executable
UNRESOLVED: gnat.dg/pack11.adb compilation failed to produce executable
UNRESOLVED: gnat.dg/pack12.adb compilation failed to produce executable
UNRESOLVED: gnat.dg/pack3.adb compilation failed to produce executable
UNRESOLVED: gnat.dg/pack4.adb compilation failed to produce executable
FAIL: gnat.dg/pack8.adb (test for errors, line 19)
FAIL: gnat.dg/pack9.adb scan-tree-dump-not optimized "__gnat_rcheck": dump file does not exist
UNRESOLVED: gnat.dg/packed_subtype.adb compilation failed to produce executable
UNRESOLVED: gnat.dg/pointer_conversion.adb compilation failed to produce executable
UNRESOLVED: gnat.dg/prot_def.adb compilation failed to produce executable
UNRESOLVED: gnat.dg/protected_self_ref1.adb compilation failed to produce executable
FAIL: gnat.dg/protected_self_ref2.adb (test for errors, line 12)
UNRESOLVED: gnat.dg/quote.adb compilation failed to produce executable
UNRESOLVED: gnat.dg/range_check.adb compilation failed to produce executable
UNRESOLVED: gnat.dg/regpat1.adb compilation failed to produce executable
UNRESOLVED: gnat.dg/release_unc_maxalign.adb compilation failed to produce executable
UNRESOLVED: gnat.dg/renaming2.adb compilation failed to produce executable
UNRESOLVED: gnat.dg/renaming3.adb compilation failed to produce executable
UNRESOLVED: gnat.dg/rep_clause4.adb compilation failed to produce executable
UNRESOLVED: gnat.dg/requeue1.adb compilation failed to produce executable
UNRESOLVED: gnat.dg/scalar_mode_agg_compare.adb compilation failed to produce executable
UNRESOLVED: gnat.dg/self_aggregate_with_array.adb compilation failed to produce executable
UNRESOLVED: gnat.dg/self_aggregate_with_call.adb compilatio
 

Thread Tools




All times are GMT. The time now is 07:02 PM.

VBulletin, Copyright ©2000 - 2014, Jelsoft Enterprises Ltd.
Content Relevant URLs by vBSEO ©2007, Crawlability, Inc.
Copyright 2007 - 2008, www.linux-archive.org