FAQ Search Today's Posts Mark Forums Read
» Video Reviews

» Linux Archive

Linux-archive is a website aiming to archive linux email lists and to make them easily accessible for linux users/developers.


» Sponsor

» Partners

» Sponsor

Go Back   Linux Archive > Debian > Debian GCC

 
 
LinkBack Thread Tools
 
Old 10-18-2010, 05:54 PM
Matthias Klose
 
Default Results for 4.6.0 20101016 (experimental) (Debian 20101016-1) testsuite on s390-ibm-linux-gnu

LAST_UPDATED: Sat Oct 16 11:48:27 UTC 2010 (revision 165538)

Target: s390-linux-gnu
gcc version 4.6.0 20101016 (experimental) [trunk revision 165538] (Debian 20101016-1)

=== acats tests ===
FAIL: c52103x
FAIL: c52104x
FAIL: c52104y

=== acats Summary ===
# of expected passes 2318
# of unexpected failures 3
Native configuration is s390-ibm-linux-gnu

=== g++ tests ===


Running target unix
FAIL: g++.dg/debug/nullptr01.C -gdwarf-2 -g1 (internal compiler error)
FAIL: g++.dg/debug/nullptr01.C -gdwarf-2 -g1 (test for excess errors)
ERROR: g++.dg/debug/nullptr01.C: error executing dg-final: couldn't open "nullptr01.s": no such file or directory
UNRESOLVED: g++.dg/debug/nullptr01.C: error executing dg-final: couldn't open "nullptr01.s": no such file or directory
FAIL: g++.dg/debug/nullptr01.C -gdwarf-2 -g1 -O2 (internal compiler error)
FAIL: g++.dg/debug/nullptr01.C -gdwarf-2 -g1 -O2 (test for excess errors)
ERROR: g++.dg/debug/nullptr01.C: error executing dg-final: couldn't open "nullptr01.s": no such file or directory
UNRESOLVED: g++.dg/debug/nullptr01.C: error executing dg-final: couldn't open "nullptr01.s": no such file or directory
FAIL: g++.dg/debug/nullptr01.C -gdwarf-2 -g1 -O3 (internal compiler error)
FAIL: g++.dg/debug/nullptr01.C -gdwarf-2 -g1 -O3 (test for excess errors)
ERROR: g++.dg/debug/nullptr01.C: error executing dg-final: couldn't open "nullptr01.s": no such file or directory
UNRESOLVED: g++.dg/debug/nullptr01.C: error executing dg-final: couldn't open "nullptr01.s": no such file or directory
FAIL: g++.dg/debug/nullptr01.C -gdwarf-2 (internal compiler error)
FAIL: g++.dg/debug/nullptr01.C -gdwarf-2 (test for excess errors)
ERROR: g++.dg/debug/nullptr01.C: error executing dg-final: couldn't open "nullptr01.s": no such file or directory
UNRESOLVED: g++.dg/debug/nullptr01.C: error executing dg-final: couldn't open "nullptr01.s": no such file or directory
FAIL: g++.dg/debug/nullptr01.C -gdwarf-2 -O2 (internal compiler error)
FAIL: g++.dg/debug/nullptr01.C -gdwarf-2 -O2 (test for excess errors)
ERROR: g++.dg/debug/nullptr01.C: error executing dg-final: couldn't open "nullptr01.s": no such file or directory
UNRESOLVED: g++.dg/debug/nullptr01.C: error executing dg-final: couldn't open "nullptr01.s": no such file or directory
FAIL: g++.dg/debug/nullptr01.C -gdwarf-2 -O3 (internal compiler error)
FAIL: g++.dg/debug/nullptr01.C -gdwarf-2 -O3 (test for excess errors)
ERROR: g++.dg/debug/nullptr01.C: error executing dg-final: couldn't open "nullptr01.s": no such file or directory
UNRESOLVED: g++.dg/debug/nullptr01.C: error executing dg-final: couldn't open "nullptr01.s": no such file or directory
FAIL: g++.dg/debug/nullptr01.C -gdwarf-2 -g3 (internal compiler error)
FAIL: g++.dg/debug/nullptr01.C -gdwarf-2 -g3 (test for excess errors)
ERROR: g++.dg/debug/nullptr01.C: error executing dg-final: couldn't open "nullptr01.s": no such file or directory
UNRESOLVED: g++.dg/debug/nullptr01.C: error executing dg-final: couldn't open "nullptr01.s": no such file or directory
FAIL: g++.dg/debug/nullptr01.C -gdwarf-2 -g3 -O2 (internal compiler error)
FAIL: g++.dg/debug/nullptr01.C -gdwarf-2 -g3 -O2 (test for excess errors)
ERROR: g++.dg/debug/nullptr01.C: error executing dg-final: couldn't open "nullptr01.s": no such file or directory
UNRESOLVED: g++.dg/debug/nullptr01.C: error executing dg-final: couldn't open "nullptr01.s": no such file or directory
FAIL: g++.dg/debug/nullptr01.C -gdwarf-2 -g3 -O3 (internal compiler error)
FAIL: g++.dg/debug/nullptr01.C -gdwarf-2 -g3 -O3 (test for excess errors)
ERROR: g++.dg/debug/nullptr01.C: error executing dg-final: couldn't open "nullptr01.s": no such file or directory
UNRESOLVED: g++.dg/debug/nullptr01.C: error executing dg-final: couldn't open "nullptr01.s": no such file or directory
FAIL: g++.dg/debug/nullptr01.C -gstabs1 (internal compiler error)
FAIL: g++.dg/debug/nullptr01.C -gstabs1 (test for excess errors)
ERROR: g++.dg/debug/nullptr01.C: error executing dg-final: couldn't open "nullptr01.s": no such file or directory
UNRESOLVED: g++.dg/debug/nullptr01.C: error executing dg-final: couldn't open "nullptr01.s": no such file or directory
FAIL: g++.dg/debug/nullptr01.C -gstabs1 -O2 (internal compiler error)
FAIL: g++.dg/debug/nullptr01.C -gstabs1 -O2 (test for excess errors)
ERROR: g++.dg/debug/nullptr01.C: error executing dg-final: couldn't open "nullptr01.s": no such file or directory
UNRESOLVED: g++.dg/debug/nullptr01.C: error executing dg-final: couldn't open "nullptr01.s": no such file or directory
FAIL: g++.dg/debug/nullptr01.C -gstabs1 -O3 (internal compiler error)
FAIL: g++.dg/debug/nullptr01.C -gstabs1 -O3 (test for excess errors)
ERROR: g++.dg/debug/nullptr01.C: error executing dg-final: couldn't open "nullptr01.s": no such file or directory
UNRESOLVED: g++.dg/debug/nullptr01.C: error executing dg-final: couldn't open "nullptr01.s": no such file or directory
FAIL: g++.dg/debug/nullptr01.C -gstabs (internal compiler error)
FAIL: g++.dg/debug/nullptr01.C -gstabs (test for excess errors)
ERROR: g++.dg/debug/nullptr01.C: error executing dg-final: couldn't open "nullptr01.s": no such file or directory
UNRESOLVED: g++.dg/debug/nullptr01.C: error executing dg-final: couldn't open "nullptr01.s": no such file or directory
FAIL: g++.dg/debug/nullptr01.C -gstabs -O2 (internal compiler error)
FAIL: g++.dg/debug/nullptr01.C -gstabs -O2 (test for excess errors)
ERROR: g++.dg/debug/nullptr01.C: error executing dg-final: couldn't open "nullptr01.s": no such file or directory
UNRESOLVED: g++.dg/debug/nullptr01.C: error executing dg-final: couldn't open "nullptr01.s": no such file or directory
FAIL: g++.dg/debug/nullptr01.C -gstabs -O3 (internal compiler error)
FAIL: g++.dg/debug/nullptr01.C -gstabs -O3 (test for excess errors)
ERROR: g++.dg/debug/nullptr01.C: error executing dg-final: couldn't open "nullptr01.s": no such file or directory
UNRESOLVED: g++.dg/debug/nullptr01.C: error executing dg-final: couldn't open "nullptr01.s": no such file or directory
FAIL: g++.dg/debug/nullptr01.C -gstabs3 (internal compiler error)
FAIL: g++.dg/debug/nullptr01.C -gstabs3 (test for excess errors)
ERROR: g++.dg/debug/nullptr01.C: error executing dg-final: couldn't open "nullptr01.s": no such file or directory
UNRESOLVED: g++.dg/debug/nullptr01.C: error executing dg-final: couldn't open "nullptr01.s": no such file or directory
FAIL: g++.dg/debug/nullptr01.C -gstabs3 -O2 (internal compiler error)
FAIL: g++.dg/debug/nullptr01.C -gstabs3 -O2 (test for excess errors)
ERROR: g++.dg/debug/nullptr01.C: error executing dg-final: couldn't open "nullptr01.s": no such file or directory
UNRESOLVED: g++.dg/debug/nullptr01.C: error executing dg-final: couldn't open "nullptr01.s": no such file or directory
FAIL: g++.dg/debug/nullptr01.C -gstabs3 -O3 (internal compiler error)
FAIL: g++.dg/debug/nullptr01.C -gstabs3 -O3 (test for excess errors)
ERROR: g++.dg/debug/nullptr01.C: error executing dg-final: couldn't open "nullptr01.s": no such file or directory
UNRESOLVED: g++.dg/debug/nullptr01.C: error executing dg-final: couldn't open "nullptr01.s": no such file or directory
FAIL: g++.dg/debug/nullptr01.C -gstabs+1 (internal compiler error)
FAIL: g++.dg/debug/nullptr01.C -gstabs+1 (test for excess errors)
ERROR: g++.dg/debug/nullptr01.C: error executing dg-final: couldn't open "nullptr01.s": no such file or directory
UNRESOLVED: g++.dg/debug/nullptr01.C: error executing dg-final: couldn't open "nullptr01.s": no such file or directory
FAIL: g++.dg/debug/nullptr01.C -gstabs+1 -O2 (internal compiler error)
FAIL: g++.dg/debug/nullptr01.C -gstabs+1 -O2 (test for excess errors)
ERROR: g++.dg/debug/nullptr01.C: error executing dg-final: couldn't open "nullptr01.s": no such file or directory
UNRESOLVED: g++.dg/debug/nullptr01.C: error executing dg-final: couldn't open "nullptr01.s": no such file or directory
FAIL: g++.dg/debug/nullptr01.C -gstabs+1 -O3 (internal compiler error)
FAIL: g++.dg/debug/nullptr01.C -gstabs+1 -O3 (test for excess errors)
ERROR: g++.dg/debug/nullptr01.C: error executing dg-final: couldn't open "nullptr01.s": no such file or directory
UNRESOLVED: g++.dg/debug/nullptr01.C: error executing dg-final: couldn't open "nullptr01.s": no such file or directory
FAIL: g++.dg/debug/nullptr01.C -gstabs+ (internal compiler error)
FAIL: g++.dg/debug/nullptr01.C -gstabs+ (test for excess errors)
ERROR: g++.dg/debug/nullptr01.C: error executing dg-final: couldn't open "nullptr01.s": no such file or directory
UNRESOLVED: g++.dg/debug/nullptr01.C: error executing dg-final: couldn't open "nullptr01.s": no such file or directory
FAIL: g++.dg/debug/nullptr01.C -gstabs+ -O2 (internal compiler error)
FAIL: g++.dg/debug/nullptr01.C -gstabs+ -O2 (test for excess errors)
ERROR: g++.dg/debug/nullptr01.C: error executing dg-final: couldn't open "nullptr01.s": no such file or directory
UNRESOLVED: g++.dg/debug/nullptr01.C: error executing dg-final: couldn't open "nullptr01.s": no such file or directory
FAIL: g++.dg/debug/nullptr01.C -gstabs+ -O3 (internal compiler error)
FAIL: g++.dg/debug/nullptr01.C -gstabs+ -O3 (test for excess errors)
ERROR: g++.dg/debug/nullptr01.C: error executing dg-final: couldn't open "nullptr01.s": no such file or directory
UNRESOLVED: g++.dg/debug/nullptr01.C: error executing dg-final: couldn't open "nullptr01.s": no such file or directory
FAIL: g++.dg/debug/nullptr01.C -gstabs+3 (internal compiler error)
FAIL: g++.dg/debug/nullptr01.C -gstabs+3 (test for excess errors)
ERROR: g++.dg/debug/nullptr01.C: error executing dg-final: couldn't open "nullptr01.s": no such file or directory
UNRESOLVED: g++.dg/debug/nullptr01.C: error executing dg-final: couldn't open "nullptr01.s": no such file or directory
FAIL: g++.dg/debug/nullptr01.C -gstabs+3 -O2 (internal compiler error)
FAIL: g++.dg/debug/nullptr01.C -gstabs+3 -O2 (test for excess errors)
ERROR: g++.dg/debug/nullptr01.C: error executing dg-final: couldn't open "nullptr01.s": no such file or directory
UNRESOLVED: g++.dg/debug/nullptr01.C: error executing dg-final: couldn't open "nullptr01.s": no such file or directory
FAIL: g++.dg/debug/nullptr01.C -gstabs+3 -O3 (internal compiler error)
FAIL: g++.dg/debug/nullptr01.C -gstabs+3 -O3 (test for excess errors)
ERROR: g++.dg/debug/nullptr01.C: error executing dg-final: couldn't open "nullptr01.s": no such file or directory
UNRESOLVED: g++.dg/debug/nullptr01.C: error executing dg-final: couldn't open "nullptr01.s": no such file or directory
FAIL: g++.dg/debug/dwarf2/icf.C scan-assembler \.section.*.debug_dcall
FAIL: g++.dg/debug/dwarf2/icf.C scan-assembler New caller
FAIL: g++.dg/debug/dwarf2/icf.C scan-assembler Caller DIE offset
FAIL: g++.dg/debug/dwarf2/icf.C scan-assembler Callee DIE offset
FAIL: g++.dg/cpp0x/nullptr16.C (internal compiler error)
FAIL: g++.dg/cpp0x/nullptr16.C (test for excess errors)
FAIL: g++.dg/template/char1.C (test for warnings, line 4)
FAIL: g++.dg/lto/20101010-4 cp_lto_20101010-4_0.o assemble, -std=c++0x -flto -r -nostdlib (internal compiler error)
UNRESOLVED: g++.dg/lto/20101010-4 cp_lto_20101010-4_0.o-cp_lto_20101010-4_0.o link -std=c++0x -flto -r -nostdlib
UNRESOLVED: g++.dg/lto/20101010-4 cp_lto_20101010-4_0.o-cp_lto_20101010-4_0.o execute -std=c++0x -flto -r -nostdlib
FAIL: g++.dg/lto/20101010-4 cp_lto_20101010-4_0.o assemble, -std=c++0x -flto -g -r -nostdlib (internal compiler error)
UNRESOLVED: g++.dg/lto/20101010-4 cp_lto_20101010-4_0.o-cp_lto_20101010-4_0.o link -std=c++0x -flto -g -r -nostdlib
UNRESOLVED: g++.dg/lto/20101010-4 cp_lto_20101010-4_0.o-cp_lto_20101010-4_0.o execute -std=c++0x -flto -g -r -nostdlib
UNRESOLVED: attribute_plugin.c compilation, -I. -I/build/buildd-gcc-snapshot_20101016-1-s390-SUosHl/gcc-snapshot-20101016/src/gcc/testsuite -I/build/buildd-gcc-snapshot_20101016-1-s390-SUosHl/gcc-snapshot-20101016/src/gcc/testsuite/../../gcc -I/build/buildd-gcc-snapshot_20101016-1-s390-SUosHl/gcc-snapshot-20101016/build/gcc/testsuite/g++/../../../gcc -I/build/buildd-gcc-snapshot_20101016-1-s390-SUosHl/gcc-snapshot-20101016/src/gcc/testsuite/../../include -I/build/buildd-gcc-snapshot_20101016-1-s390-SUosHl/gcc-snapshot-20101016/src/gcc/testsuite/../../libcpp/include -I/build/buildd-gcc-snapshot_20101016-1-s390-SUosHl/gcc-snapshot-20101016/build/gcc/testsuite/g++/../../../intl -DIN_GCC -fPIC -shared
UNRESOLVED: pragma_plugin.c compilation, -I. -I/build/buildd-gcc-snapshot_20101016-1-s390-SUosHl/gcc-snapshot-20101016/src/gcc/testsuite -I/build/buildd-gcc-snapshot_20101016-1-s390-SUosHl/gcc-snapshot-20101016/src/gcc/testsuite/../../gcc -I/build/buildd-gcc-snapshot_20101016-1-s390-SUosHl/gcc-snapshot-20101016/build/gcc/testsuite/g++/../../../gcc -I/build/buildd-gcc-snapshot_20101016-1-s390-SUosHl/gcc-snapshot-20101016/src/gcc/testsuite/../../include -I/build/buildd-gcc-snapshot_20101016-1-s390-SUosHl/gcc-snapshot-20101016/src/gcc/testsuite/../../libcpp/include -I/build/buildd-gcc-snapshot_20101016-1-s390-SUosHl/gcc-snapshot-20101016/build/gcc/testsuite/g++/../../../intl -DIN_GCC -fPIC -shared
UNRESOLVED: selfassign.c compilation, -I. -I/build/buildd-gcc-snapshot_20101016-1-s390-SUosHl/gcc-snapshot-20101016/src/gcc/testsuite -I/build/buildd-gcc-snapshot_20101016-1-s390-SUosHl/gcc-snapshot-20101016/src/gcc/testsuite/../../gcc -I/build/buildd-gcc-snapshot_20101016-1-s390-SUosHl/gcc-snapshot-20101016/build/gcc/testsuite/g++/../../../gcc -I/build/buildd-gcc-snapshot_20101016-1-s390-SUosHl/gcc-snapshot-20101016/src/gcc/testsuite/../../include -I/build/buildd-gcc-snapshot_20101016-1-s390-SUosHl/gcc-snapshot-20101016/src/gcc/testsuite/../../libcpp/include -I/build/buildd-gcc-snapshot_20101016-1-s390-SUosHl/gcc-snapshot-20101016/build/gcc/testsuite/g++/../../../intl -O -DIN_GCC -fPIC -shared
UNRESOLVED: dumb_plugin.c compilation, -I. -I/build/buildd-gcc-snapshot_20101016-1-s390-SUosHl/gcc-snapshot-20101016/src/gcc/testsuite -I/build/buildd-gcc-snapshot_20101016-1-s390-SUosHl/gcc-snapshot-20101016/src/gcc/testsuite/../../gcc -I/build/buildd-gcc-snapshot_20101016-1-s390-SUosHl/gcc-snapshot-20101016/build/gcc/testsuite/g++/../../../gcc -I/build/buildd-gcc-snapshot_20101016-1-s390-SUosHl/gcc-snapshot-20101016/src/gcc/testsuite/../../include -I/build/buildd-gcc-snapshot_20101016-1-s390-SUosHl/gcc-snapshot-20101016/src/gcc/testsuite/../../libcpp/include -I/build/buildd-gcc-snapshot_20101016-1-s390-SUosHl/gcc-snapshot-20101016/build/gcc/testsuite/g++/../../../intl -DIN_GCC -fPIC -shared
UNRESOLVED: header_plugin.c compilation, -I. -I/build/buildd-gcc-snapshot_20101016-1-s390-SUosHl/gcc-snapshot-20101016/src/gcc/testsuite -I/build/buildd-gcc-snapshot_20101016-1-s390-SUosHl/gcc-snapshot-20101016/src/gcc/testsuite/../../gcc -I/build/buildd-gcc-snapshot_20101016-1-s390-SUosHl/gcc-snapshot-20101016/build/gcc/testsuite/g++/../../../gcc -I/build/buildd-gcc-snapshot_20101016-1-s390-SUosHl/gcc-snapshot-20101016/src/gcc/testsuite/../../include -I/build/buildd-gcc-snapshot_20101016-1-s390-SUosHl/gcc-snapshot-20101016/src/gcc/testsuite/../../libcpp/include -I/build/buildd-gcc-snapshot_20101016-1-s390-SUosHl/gcc-snapshot-20101016/build/gcc/testsuite/g++/../../../intl -DIN_GCC -fPIC -shared

=== g++ Summary for unix ===

# of expected passes 24431
# of unexpected failures 63
# of expected failures 150
# of unresolved testcases 36
# of unsupported tests 371

Running target unix/-m64
FAIL: g++.dg/debug/nullptr01.C -gdwarf-2 -g1 (internal compiler error)
FAIL: g++.dg/debug/nullptr01.C -gdwarf-2 -g1 (test for excess errors)
ERROR: g++.dg/debug/nullptr01.C: error executing dg-final: couldn't open "nullptr01.s": no such file or directory
UNRESOLVED: g++.dg/debug/nullptr01.C: error executing dg-final: couldn't open "nullptr01.s": no such file or directory
FAIL: g++.dg/debug/nullptr01.C -gdwarf-2 -g1 -O2 (internal compiler error)
FAIL: g++.dg/debug/nullptr01.C -gdwarf-2 -g1 -O2 (test for excess errors)
ERROR: g++.dg/debug/nullptr01.C: error executing dg-final: couldn't open "nullptr01.s": no such file or directory
UNRESOLVED: g++.dg/debug/nullptr01.C: error executing dg-final: couldn't open "nullptr01.s": no such file or directory
FAIL: g++.dg/debug/nullptr01.C -gdwarf-2 -g1 -O3 (internal compiler error)
FAIL: g++.dg/debug/nullptr01.C -gdwarf-2 -g1 -O3 (test for excess errors)
ERROR: g++.dg/debug/nullptr01.C: error executing dg-final: couldn't open "nullptr01.s": no such file or directory
UNRESOLVED: g++.dg/debug/nullptr01.C: error executing dg-final: couldn't open "nullptr01.s": no such file or directory
FAIL: g++.dg/debug/nullptr01.C -gdwarf-2 (internal compiler error)
FAIL: g++.dg/debug/nullptr01.C -gdwarf-2 (test for excess errors)
ERROR: g++.dg/debug/nullptr01.C: error executing dg-final: couldn't open "nullptr01.s": no such file or directory
UNRESOLVED: g++.dg/debug/nullptr01.C: error executing dg-final: couldn't open "nullptr01.s": no such file or directory
FAIL: g++.dg/debug/nullptr01.C -gdwarf-2 -O2 (internal compiler error)
FAIL: g++.dg/debug/nullptr01.C -gdwarf-2 -O2 (test for excess errors)
ERROR: g++.dg/debug/nullptr01.C: error executing dg-final: couldn't open "nullptr01.s": no such file or directory
UNRESOLVED: g++.dg/debug/nullptr01.C: error executing dg-final: couldn't open "nullptr01.s": no such file or directory
FAIL: g++.dg/debug/nullptr01.C -gdwarf-2 -O3 (internal compiler error)
FAIL: g++.dg/debug/nullptr01.C -gdwarf-2 -O3 (test for excess errors)
ERROR: g++.dg/debug/nullptr01.C: error executing dg-final: couldn't open "nullptr01.s": no such file or directory
UNRESOLVED: g++.dg/debug/nullptr01.C: error executing dg-final: couldn't open "nullptr01.s": no such file or directory
FAIL: g++.dg/debug/nullptr01.C -gdwarf-2 -g3 (internal compiler error)
FAIL: g++.dg/debug/nullptr01.C -gdwarf-2 -g3 (test for excess errors)
ERROR: g++.dg/debug/nullptr01.C: error executing dg-final: couldn't open "nullptr01.s": no such file or directory
UNRESOLVED: g++.dg/debug/nullptr01.C: error executing dg-final: couldn't open "nullptr01.s": no such file or directory
FAIL: g++.dg/debug/nullptr01.C -gdwarf-2 -g3 -O2 (internal compiler error)
FAIL: g++.dg/debug/nullptr01.C -gdwarf-2 -g3 -O2 (test for excess errors)
ERROR: g++.dg/debug/nullptr01.C: error executing dg-final: couldn't open "nullptr01.s": no such file or directory
UNRESOLVED: g++.dg/debug/nullptr01.C: error executing dg-final: couldn't open "nullptr01.s": no such file or directory
FAIL: g++.dg/debug/nullptr01.C -gdwarf-2 -g3 -O3 (internal compiler error)
FAIL: g++.dg/debug/nullptr01.C -gdwarf-2 -g3 -O3 (test for excess errors)
ERROR: g++.dg/debug/nullptr01.C: error executing dg-final: couldn't open "nullptr01.s": no such file or directory
UNRESOLVED: g++.dg/debug/nullptr01.C: error executing dg-final: couldn't open "nullptr01.s": no such file or directory
FAIL: g++.dg/debug/nullptr01.C -gstabs1 (internal compiler error)
FAIL: g++.dg/debug/nullptr01.C -gstabs1 (test for excess errors)
ERROR: g++.dg/debug/nullptr01.C: error executing dg-final: couldn't open "nullptr01.s": no such file or directory
UNRESOLVED: g++.dg/debug/nullptr01.C: error executing dg-final: couldn't open "nullptr01.s": no such file or directory
FAIL: g++.dg/debug/nullptr01.C -gstabs1 -O2 (internal compiler error)
FAIL: g++.dg/debug/nullptr01.C -gstabs1 -O2 (test for excess errors)
ERROR: g++.dg/debug/nullptr01.C: error executing dg-final: couldn't open "nullptr01.s": no such file or directory
UNRESOLVED: g++.dg/debug/nullptr01.C: error executing dg-final: couldn't open "nullptr01.s": no such file or directory
FAIL: g++.dg/debug/nullptr01.C -gstabs1 -O3 (internal compiler error)
FAIL: g++.dg/debug/nullptr01.C -gstabs1 -O3 (test for excess errors)
ERROR: g++.dg/debug/nullptr01.C: error executing dg-final: couldn't open "nullptr01.s": no such file or directory
UNRESOLVED: g++.dg/debug/nullptr01.C: error executing dg-final: couldn't open "nullptr01.s": no such file or directory
FAIL: g++.dg/debug/nullptr01.C -gstabs (internal compiler error)
FAIL: g++.dg/debug/nullptr01.C -gstabs (test for excess errors)
ERROR: g++.dg/debug/nullptr01.C: error executing dg-final: couldn't open "nullptr01.s": no such file or directory
UNRESOLVED: g++.dg/debug/nullptr01.C: error executing dg-final: couldn't open "nullptr01.s": no such file or directory
FAIL: g++.dg/debug/nullptr01.C -gstabs -O2 (internal compiler error)
FAIL: g++.dg/debug/nullptr01.C -gstabs -O2 (test for excess errors)
ERROR: g++.dg/debug/nullptr01.C: error executing dg-final: couldn't open "nullptr01.s": no such file or directory
UNRESOLVED: g++.dg/debug/nullptr01.C: error executing dg-final: couldn't open "nullptr01.s": no such file or directory
FAIL: g++.dg/debug/nullptr01.C -gstabs -O3 (internal compiler error)
FAIL: g++.dg/debug/nullptr01.C -gstabs -O3 (test for excess errors)
ERROR: g++.dg/debug/nullptr01.C: error executing dg-final: couldn't open "nullptr01.s": no such file or directory
UNRESOLVED: g++.dg/debug/nullptr01.C: error executing dg-final: couldn't open "nullptr01.s": no such file or directory
FAIL: g++.dg/debug/nullptr01.C -gstabs3 (internal compiler error)
FAIL: g++.dg/debug/nullptr01.C -gstabs3 (test for excess errors)
ERROR: g++.dg/debug/nullptr01.C: error executing dg-final: couldn't open "nullptr01.s": no such file or directory
UNRESOLVED: g++.dg/debug/nullptr01.C: error executing dg-final: couldn't open "nullptr01.s": no such file or directory
FAIL: g++.dg/debug/nullptr01.C -gstabs3 -O2 (internal compiler error)
FAIL: g++.dg/debug/nullptr01.C -gstabs3 -O2 (test for excess errors)
ERROR: g++.dg/debug/nullptr01.C: error executing dg-final: couldn't open "nullptr01.s": no such file or directory
UNRESOLVED: g++.dg/debug/nullptr01.C: error executing dg-final: couldn't open "nullptr01.s": no such file or directory
FAIL: g++.dg/debug/nullptr01.C -gstabs3 -O3 (internal compiler error)
FAIL: g++.dg/debug/nullptr01.C -gstabs3 -O3 (test for excess errors)
ERROR: g++.dg/debug/nullptr01.C: error executing dg-final: couldn't open "nullptr01.s": no such file or directory
UNRESOLVED: g++.dg/debug/nullptr01.C: error executing dg-final: couldn't open "nullptr01.s": no such file or directory
FAIL: g++.dg/debug/nullptr01.C -gstabs+1 (internal compiler error)
FAIL: g++.dg/debug/nullptr01.C -gstabs+1 (test for excess errors)
ERROR: g++.dg/debug/nullptr01.C: error executing dg-final: couldn't open "nullptr01.s": no such file or directory
UNRESOLVED: g++.dg/debug/nullptr01.C: error executing dg-final: couldn't open "nullptr01.s": no such file or directory
FAIL: g++.dg/debug/nullptr01.C -gstabs+1 -O2 (internal compiler error)
FAIL: g++.dg/debug/nullptr01.C -gstabs+1 -O2 (test for excess errors)
ERROR: g++.dg/debug/nullptr01.C: error executing dg-final: couldn't open "nullptr01.s": no such file or directory
UNRESOLVED: g++.dg/debug/nullptr01.C: error executing dg-final: couldn't open "nullptr01.s": no such file or directory
FAIL: g++.dg/debug/nullptr01.C -gstabs+1 -O3 (internal compiler error)
FAIL: g++.dg/debug/nullptr01.C -gstabs+1 -O3 (test for excess errors)
ERROR: g++.dg/debug/nullptr01.C: error executing dg-final: couldn't open "nullptr01.s": no such file or directory
UNRESOLVED: g++.dg/debug/nullptr01.C: error executing dg-final: couldn't open "nullptr01.s": no such file or directory
FAIL: g++.dg/debug/nullptr01.C -gstabs+ (internal compiler error)
FAIL: g++.dg/debug/nullptr01.C -gstabs+ (test for excess errors)
ERROR: g++.dg/debug/nullptr01.C: error executing dg-final: couldn't open "nullptr01.s": no such file or directory
UNRESOLVED: g++.dg/debug/nullptr01.C: error executing dg-final: couldn't open "nullptr01.s": no such file or directory
FAIL: g++.dg/debug/nullptr01.C -gstabs+ -O2 (internal compiler error)
FAIL: g++.dg/debug/nullptr01.C -gstabs+ -O2 (test for excess errors)
ERROR: g++.dg/debug/nullptr01.C: error executing dg-final: couldn't open "nullptr01.s": no such file or directory
UNRESOLVED: g++.dg/debug/nullptr01.C: error executing dg-final: couldn't open "nullptr01.s": no such file or directory
FAIL: g++.dg/debug/nullptr01.C -gstabs+ -O3 (internal compiler error)
FAIL: g++.dg/debug/nullptr01.C -gstabs+ -O3 (test for excess errors)
ERROR: g++.dg/debug/nullptr01.C: error executing dg-final: couldn't open "nullptr01.s": no such file or directory
UNRESOLVED: g++.dg/debug/nullptr01.C: error executing dg-final: couldn't open "nullptr01.s": no such file or directory
FAIL: g++.dg/debug/nullptr01.C -gstabs+3 (internal compiler error)
FAIL: g++.dg/debug/nullptr01.C -gstabs+3 (test for excess errors)
ERROR: g++.dg/debug/nullptr01.C: error executing dg-final: couldn't open "nullptr01.s": no such file or directory
UNRESOLVED: g++.dg/debug/nullptr01.C: error executing dg-final: couldn't open "nullptr01.s": no such file or directory
FAIL: g++.dg/debug/nullptr01.C -gstabs+3 -O2 (internal compiler error)
FAIL: g++.dg/debug/nullptr01.C -gstabs+3 -O2 (test for excess errors)
ERROR: g++.dg/debug/nullptr01.C: error executing dg-final: couldn't open "nullptr01.s": no such file or directory
UNRESOLVED: g++.dg/debug/nullptr01.C: error executing dg-final: couldn't open "nullptr01.s": no such file or directory
FAIL: g++.dg/debug/nullptr01.C -gstabs+3 -O3 (internal compiler error)
FAIL: g++.dg/debug/nullptr01.C -gstabs+3 -O3 (test for excess errors)
ERROR: g++.dg/debug/nullptr01.C: error executing dg-final: couldn't open "nullptr01.s": no such file or directory
UNRESOLVED: g++.dg/debug/nullptr01.C: error executing dg-final: couldn't open "nullptr01.s": no such file or directory
FAIL: g++.dg/cpp0x/nullptr16.C (internal compiler error)
FAIL: g++.dg/cpp0x/nullptr16.C (test for excess errors)
FAIL: g++.dg/template/char1.C (test for warnings, line 4)
FAIL: g++.dg/lto/20101010-4 cp_lto_20101010-4_0.o assemble, -std=c++0x -flto -r -nostdlib (internal compiler error)
UNRESOLVED: g++.dg/lto/20101010-4 cp_lto_20101010-4_0.o-cp_lto_20101010-4_0.o link -std=c++0x -flto -r -nostdlib
UNRESOLVED: g++.dg/lto/20101010-4 cp_lto_20101010-4_0.o-cp_lto_20101010-4_0.o execute -std=c++0x -flto -r -nostdlib
FAIL: g++.dg/lto/20101010-4 cp_lto_20101010-4_0.o assemble, -std=c++0x -flto -g -r -nostdlib (internal compiler error)
UNRESOLVED: g++.dg/lto/20101010-4 cp_lto_20101010-4_0.o-cp_lto_20101010-4_0.o link -std=c++0x -flto -g -r -nostdlib
UNRESOLVED: g++.dg/lto/20101010-4 cp_lto_20101010-4_0.o-cp_lto_20101010-4_0.o execute -std=c++0x -flto -g -r -nostdlib
UNRESOLVED: attribute_plugin.c compilation, -I. -I/build/buildd-gcc-snapshot_20101016-1-s390-SUosHl/gcc-snapshot-20101016/src/gcc/testsuite -I/build/buildd-gcc-snapshot_20101016-1-s390-SUosHl/gcc-snapshot-20101016/src/gcc/testsuite/../../gcc -I/build/buildd-gcc-snapshot_20101016-1-s390-SUosHl/gcc-snapshot-20101016/build/gcc/testsuite/g++/../../../gcc -I/build/buildd-gcc-snapshot_20101016-1-s390-SUosHl/gcc-snapshot-20101016/src/gcc/testsuite/../../include -I/build/buildd-gcc-snapshot_20101016-1-s390-SUosHl/gcc-snapshot-20101016/src/gcc/testsuite/../../libcpp/include -I/build/buildd-gcc-snapshot_20101016-1-s390-SUosHl/gcc-snapshot-20101016/build/gcc/testsuite/g++/../../../intl -DIN_GCC -fPIC -shared
UNRESOLVED: pragma_plugin.c compilation, -I. -I/build/buildd-gcc-snapshot_20101016-1-s390-SUosHl/gcc-snapshot-20101016/src/gcc/testsuite -I/build/buildd-gcc-snapshot_20101016-1-s390-SUosHl/gcc-snapshot-20101016/src/gcc/testsuite/../../gcc -I/build/buildd-gcc-snapshot_20101016-1-s390-SUosHl/gcc-snapshot-20101016/build/gcc/testsuite/g++/../../../gcc -I/build/buildd-gcc-snapshot_20101016-1-s390-SUosHl/gcc-snapshot-20101016/src/gcc/testsuite/../../include -I/build/buildd-gcc-snapshot_20101016-1-s390-SUosHl/gcc-snapshot-20101016/src/gcc/testsuite/../../libcpp/include -I/build/buildd-gcc-snapshot_20101016-1-s390-SUosHl/gcc-snapshot-20101016/build/gcc/testsuite/g++/../../../intl -DIN_GCC -fPIC -shared
UNRESOLVED: selfassign.c compilation, -I. -I/build/buildd-gcc-snapshot_20101016-1-s390-SUosHl/gcc-snapshot-20101016/src/gcc/testsuite -I/build/buildd-gcc-snapshot_20101016-1-s390-SUosHl/gcc-snapshot-20101016/src/gcc/testsuite/../../gcc -I/build/buildd-gcc-snapshot_20101016-1-s390-SUosHl/gcc-snapshot-20101016/build/gcc/testsuite/g++/../../../gcc -I/build/buildd-gcc-snapshot_20101016-1-s390-SUosHl/gcc-snapshot-20101016/src/gcc/testsuite/../../include -I/build/buildd-gcc-snapshot_20101016-1-s390-SUosHl/gcc-snapshot-20101016/src/gcc/testsuite/../../libcpp/include -I/build/buildd-gcc-snapshot_20101016-1-s390-SUosHl/gcc-snapshot-20101016/build/gcc/testsuite/g++/../../../intl -O -DIN_GCC -fPIC -shared
UNRESOLVED: dumb_plugin.c compilation, -I. -I/build/buildd-gcc-snapshot_20101016-1-s390-SUosHl/gcc-snapshot-20101016/src/gcc/testsuite -I/build/buildd-gcc-snapshot_20101016-1-s390-SUosHl/gcc-snapshot-20101016/src/gcc/testsuite/../../gcc -I/build/buildd-gcc-snapshot_20101016-1-s390-SUosHl/gcc-snapshot-20101016/build/gcc/testsuite/g++/../../../gcc -I/build/buildd-gcc-snapshot_20101016-1-s390-SUosHl/gcc-snapshot-20101016/src/gcc/testsuite/../../include -I/build/buildd-gcc-snapshot_20101016-1-s390-SUosHl/gcc-snapshot-20101016/src/gcc/testsuite/../../libcpp/include -I/build/buildd-gcc-snapshot_20101016-1-s390-SUosHl/gcc-snapshot-20101016/build/gcc/testsuite/g++/../../../intl -DIN_GCC -fPIC -shared
UNRESOLVED: header_plugin.c compilation, -I. -I/build/buildd-gcc-snapshot_20101016-1-s390-SUosHl/gcc-snapshot-20101016/src/gcc/testsuite -I/build/buildd-gcc-snapshot_20101016-1-s390-SUosHl/gcc-snapshot-20101016/src/gcc/testsuite/../../gcc -I/build/buildd-gcc-snapshot_20101016-1-s390-SUosHl/gcc-snapshot-20101016/build/gcc/testsuite/g++/../../../gcc -I/build/buildd-gcc-snapshot_20101016-1-s390-SUosHl/gcc-snapshot-20101016/src/gcc/testsuite/../../include -I/build/buildd-gcc-snapshot_20101016-1-s390-SUosHl/gcc-snapshot-20101016/src/gcc/testsuite/../../libcpp/include -I/build/buildd-gcc-snapshot_20101016-1-s390-SUosHl/gcc-snapshot-20101016/build/gcc/testsuite/g++/../../../intl -DIN_GCC -fPIC -shared

=== g++ Summary for unix/-m64 ===

# of expected passes 25047
# of unexpected failures 59
# of expected failures 150
# of unresolved testcases 36
# of unsupported tests 368

=== g++ Summary ===

# of expected passes 49478
# of unexpected failures 122
# of expected failures 300
# of unresolved testcases 72
# of unsupported tests 739
/build/buildd-gcc-snapshot_20101016-1-s390-SUosHl/gcc-snapshot-20101016/build/gcc/testsuite/g++/../../g++ version 4.6.0 20101016 (experimental) [trunk revision 165538] (Debian 20101016-1)

=== gcc tests ===


Running target unix
FAIL: gcc.c-torture/execute/va-arg-13.c compilation, -O0 (internal compiler error)
UNRESOLVED: gcc.c-torture/execute/va-arg-13.c execution, -O0
FAIL: gcc.c-torture/execute/va-arg-14.c compilation, -O0 (internal compiler error)
UNRESOLVED: gcc.c-torture/execute/va-arg-14.c execution, -O0
FAIL: gcc.c-torture/execute/va-arg-14.c compilation, -O1 (internal compiler error)
UNRESOLVED: gcc.c-torture/execute/va-arg-14.c execution, -O1
FAIL: gcc.c-torture/execute/va-arg-14.c compilation, -O2 (internal compiler error)
UNRESOLVED: gcc.c-torture/execute/va-arg-14.c execution, -O2
FAIL: gcc.c-torture/execute/va-arg-14.c compilation, -O3 -fomit-frame-pointer (internal compiler error)
UNRESOLVED: gcc.c-torture/execute/va-arg-14.c execution, -O3 -fomit-frame-pointer
FAIL: gcc.c-torture/execute/va-arg-14.c compilation, -O3 -g (internal compiler error)
UNRESOLVED: gcc.c-torture/execute/va-arg-14.c execution, -O3 -g
FAIL: gcc.c-torture/execute/va-arg-14.c compilation, -Os (internal compiler error)
UNRESOLVED: gcc.c-torture/execute/va-arg-14.c execution, -Os
FAIL: gcc.c-torture/execute/va-arg-14.c compilation, -O2 -flto (internal compiler error)
UNRESOLVED: gcc.c-torture/execute/va-arg-14.c execution, -O2 -flto
FAIL: gcc.c-torture/execute/va-arg-14.c compilation, -O2 -fwhopr (internal compiler error)
UNRESOLVED: gcc.c-torture/execute/va-arg-14.c execution, -O2 -fwhopr
FAIL: gcc.c-torture/execute/va-arg-21.c compilation, -O0 (internal compiler error)
UNRESOLVED: gcc.c-torture/execute/va-arg-21.c execution, -O0
FAIL: gcc.c-torture/execute/va-arg-21.c compilation, -O1 (internal compiler error)
UNRESOLVED: gcc.c-torture/execute/va-arg-21.c execution, -O1
FAIL: gcc.c-torture/execute/va-arg-21.c compilation, -O2 (internal compiler error)
UNRESOLVED: gcc.c-torture/execute/va-arg-21.c execution, -O2
FAIL: gcc.c-torture/execute/va-arg-21.c compilation, -O3 -fomit-frame-pointer (internal compiler error)
UNRESOLVED: gcc.c-torture/execute/va-arg-21.c execution, -O3 -fomit-frame-pointer
FAIL: gcc.c-torture/execute/va-arg-21.c compilation, -O3 -fomit-frame-pointer -funroll-loops (internal compiler error)
UNRESOLVED: gcc.c-torture/execute/va-arg-21.c execution, -O3 -fomit-frame-pointer -funroll-loops
FAIL: gcc.c-torture/execute/va-arg-21.c compilation, -O3 -fomit-frame-pointer -funroll-all-loops -finline-functions (internal compiler error)
UNRESOLVED: gcc.c-torture/execute/va-arg-21.c execution, -O3 -fomit-frame-pointer -funroll-all-loops -finline-functions
FAIL: gcc.c-torture/execute/va-arg-21.c compilation, -O3 -g (internal compiler error)
UNRESOLVED: gcc.c-torture/execute/va-arg-21.c execution, -O3 -g
FAIL: gcc.c-torture/execute/va-arg-21.c compilation, -Os (internal compiler error)
UNRESOLVED: gcc.c-torture/execute/va-arg-21.c execution, -Os
FAIL: gcc.c-torture/execute/va-arg-21.c compilation, -O2 -flto (internal compiler error)
UNRESOLVED: gcc.c-torture/execute/va-arg-21.c execution, -O2 -flto
FAIL: gcc.c-torture/execute/va-arg-21.c compilation, -O2 -fwhopr (internal compiler error)
UNRESOLVED: gcc.c-torture/execute/va-arg-21.c execution, -O2 -fwhopr
FAIL: gcc.dg/c99-stdint-1.c (test for excess errors)
FAIL: gcc.dg/cproj-fails-with-broken-glibc.c execution test
FAIL: gcc.dg/falign-labels-1.c execution test
FAIL: gcc.dg/optimize-bswapsi-1.c scan-tree-dump-times bswap "32 bit bswap implementation found at" 3
FAIL: gcc.dg/stack-usage-1.c (test for excess errors)
FAIL: gcc.dg/stack-usage-1.c scan-file foo (256|264) static
FAIL: gcc.dg/uninit-13.c unconditional (test for warnings, line 8)
FAIL: gcc.dg/uninit-13.c (test for excess errors)
FAIL: gcc.dg/uninit-pred-7_a.c bogus warning (test for bogus messages, line 26)
FAIL: gcc.dg/uninit-pred-8_a.c bogus warning (test for bogus messages, line 26)
UNRESOLVED: selfassign.c compilation, -I. -I/build/buildd-gcc-snapshot_20101016-1-s390-SUosHl/gcc-snapshot-20101016/src/gcc/testsuite -I/build/buildd-gcc-snapshot_20101016-1-s390-SUosHl/gcc-snapshot-20101016/src/gcc/testsuite/../../gcc -I/build/buildd-gcc-snapshot_20101016-1-s390-SUosHl/gcc-snapshot-20101016/build/gcc/testsuite/gcc/../../../gcc -I/build/buildd-gcc-snapshot_20101016-1-s390-SUosHl/gcc-snapshot-20101016/src/gcc/testsuite/../../include -I/build/buildd-gcc-snapshot_20101016-1-s390-SUosHl/gcc-snapshot-20101016/src/gcc/testsuite/../../libcpp/include -I/build/buildd-gcc-snapshot_20101016-1-s390-SUosHl/gcc-snapshot-20101016/build/gcc/testsuite/gcc/../../../intl -O -DIN_GCC -fPIC -shared
UNRESOLVED: ggcplug.c compilation, -I. -I/build/buildd-gcc-snapshot_20101016-1-s390-SUosHl/gcc-snapshot-20101016/src/gcc/testsuite -I/build/buildd-gcc-snapshot_20101016-1-s390-SUosHl/gcc-snapshot-20101016/src/gcc/testsuite/../../gcc -I/build/buildd-gcc-snapshot_20101016-1-s390-SUosHl/gcc-snapshot-20101016/build/gcc/testsuite/gcc/../../../gcc -I/build/buildd-gcc-snapshot_20101016-1-s390-SUosHl/gcc-snapshot-20101016/src/gcc/testsuite/../../include -I/build/buildd-gcc-snapshot_20101016-1-s390-SUosHl/gcc-snapshot-20101016/src/gcc/testsuite/../../libcpp/include -I/build/buildd-gcc-snapshot_20101016-1-s390-SUosHl/gcc-snapshot-20101016/build/gcc/testsuite/gcc/../../../intl -O -DIN_GCC -fPIC -shared
UNRESOLVED: one_time_plugin.c compilation, -I. -I/build/buildd-gcc-snapshot_20101016-1-s390-SUosHl/gcc-snapshot-20101016/src/gcc/testsuite -I/build/buildd-gcc-snapshot_20101016-1-s390-SUosHl/gcc-snapshot-20101016/src/gcc/testsuite/../../gcc -I/build/buildd-gcc-snapshot_20101016-1-s390-SUosHl/gcc-snapshot-20101016/build/gcc/testsuite/gcc/../../../gcc -I/build/buildd-gcc-snapshot_20101016-1-s390-SUosHl/gcc-snapshot-20101016/src/gcc/testsuite/../../include -I/build/buildd-gcc-snapshot_20101016-1-s390-SUosHl/gcc-snapshot-20101016/src/gcc/testsuite/../../libcpp/include -I/build/buildd-gcc-snapshot_20101016-1-s390-SUosHl/gcc-snapshot-20101016/build/gcc/testsuite/gcc/../../../intl -DIN_GCC -fPIC -shared
UNRESOLVED: start_unit_plugin.c compilation, -I. -I/build/buildd-gcc-snapshot_20101016-1-s390-SUosHl/gcc-snapshot-20101016/src/gcc/testsuite -I/build/buildd-gcc-snapshot_20101016-1-s390-SUosHl/gcc-snapshot-20101016/src/gcc/testsuite/../../gcc -I/build/buildd-gcc-snapshot_20101016-1-s390-SUosHl/gcc-snapshot-20101016/build/gcc/testsuite/gcc/../../../gcc -I/build/buildd-gcc-snapshot_20101016-1-s390-SUosHl/gcc-snapshot-20101016/src/gcc/testsuite/../../include -I/build/buildd-gcc-snapshot_20101016-1-s390-SUosHl/gcc-snapshot-20101016/src/gcc/testsuite/../../libcpp/include -I/build/buildd-gcc-snapshot_20101016-1-s390-SUosHl/gcc-snapshot-20101016/build/gcc/testsuite/gcc/../../../intl -DIN_GCC -fPIC -shared
UNRESOLVED: finish_unit_plugin.c compilation, -I. -I/build/buildd-gcc-snapshot_20101016-1-s390-SUosHl/gcc-snapshot-20101016/src/gcc/testsuite -I/build/buildd-gcc-snapshot_20101016-1-s390-SUosHl/gcc-snapshot-20101016/src/gcc/testsuite/../../gcc -I/build/buildd-gcc-snapshot_20101016-1-s390-SUosHl/gcc-snapshot-20101016/build/gcc/testsuite/gcc/../../../gcc -I/build/buildd-gcc-snapshot_20101016-1-s390-SUosHl/gcc-snapshot-20101016/src/gcc/testsuite/../../include -I/build/buildd-gcc-snapshot_20101016-1-s390-SUosHl/gcc-snapshot-20101016/src/gcc/testsuite/../../libcpp/include -I/build/buildd-gcc-snapshot_20101016-1-s390-SUosHl/gcc-snapshot-20101016/build/gcc/testsuite/gcc/../../../intl -DIN_GCC -fPIC -shared
FAIL: gcc.dg/tls/pr45870.c (test for excess errors)
FAIL: gcc.dg/torture/stackalign/setjmp-1.c -O1 (internal compiler error)
FAIL: gcc.dg/torture/stackalign/setjmp-1.c -O1 (test for excess errors)
UNRESOLVED: gcc.dg/torture/stackalign/setjmp-1.c -O1 compilation failed to produce executable
FAIL: gcc.dg/torture/stackalign/setjmp-1.c -O2 (internal compiler error)
FAIL: gcc.dg/torture/stackalign/setjmp-1.c -O2 (test for excess errors)
UNRESOLVED: gcc.dg/torture/stackalign/setjmp-1.c -O2 compilation failed to produce executable
FAIL: gcc.dg/torture/stackalign/setjmp-1.c -O3 -fomit-frame-pointer (internal compiler error)
FAIL: gcc.dg/torture/stackalign/setjmp-1.c -O3 -fomit-frame-pointer (test for excess errors)
UNRESOLVED: gcc.dg/torture/stackalign/setjmp-1.c -O3 -fomit-frame-pointer compilation failed to produce executable
FAIL: gcc.dg/torture/stackalign/setjmp-1.c -O3 -fomit-frame-pointer -funroll-loops (internal compiler error)
FAIL: gcc.dg/torture/stackalign/setjmp-1.c -O3 -fomit-frame-pointer -funroll-loops (test for excess errors)
UNRESOLVED: gcc.dg/torture/stackalign/setjmp-1.c -O3 -fomit-frame-pointer -funroll-loops compilation failed to produce executable
FAIL: gcc.dg/torture/stackalign/setjmp-1.c -O3 -fomit-frame-pointer -funroll-all-loops -finline-functions (internal compiler error)
FAIL: gcc.dg/torture/stackalign/setjmp-1.c -O3 -fomit-frame-pointer -funroll-all-loops -finline-functions (test for excess errors)
UNRESOLVED: gcc.dg/torture/stackalign/setjmp-1.c -O3 -fomit-frame-pointer -funroll-all-loops -finline-functions compilation failed to produce executable
FAIL: gcc.dg/torture/stackalign/setjmp-1.c -O3 -g (internal compiler error)
FAIL: gcc.dg/torture/stackalign/setjmp-1.c -O3 -g (test for excess errors)
UNRESOLVED: gcc.dg/torture/stackalign/setjmp-1.c -O3 -g compilation failed to produce executable
FAIL: gcc.dg/torture/stackalign/setjmp-1.c -Os (internal compiler error)
FAIL: gcc.dg/torture/stackalign/setjmp-1.c -Os (test for excess errors)
UNRESOLVED: gcc.dg/torture/stackalign/setjmp-1.c -Os compilation failed to produce executable
FAIL: gcc.dg/torture/stackalign/setjmp-1.c -O2 -flto (internal compiler error)
FAIL: gcc.dg/torture/stackalign/setjmp-1.c -O2 -flto (test for excess errors)
UNRESOLVED: gcc.dg/torture/stackalign/setjmp-1.c -O2 -flto compilation failed to produce executable
FAIL: gcc.dg/torture/stackalign/setjmp-1.c -O2 -fwhopr (internal compiler error)
FAIL: gcc.dg/torture/stackalign/setjmp-1.c -O2 -fwhopr (test for excess errors)
UNRESOLVED: gcc.dg/torture/stackalign/setjmp-1.c -O2 -fwhopr compilation failed to produce executable
FAIL: gcc.dg/torture/stackalign/setjmp-3.c -O1 (internal compiler error)
FAIL: gcc.dg/torture/stackalign/setjmp-3.c -O1 (test for excess errors)
UNRESOLVED: gcc.dg/torture/stackalign/setjmp-3.c -O1 compilation failed to produce executable
FAIL: gcc.dg/torture/stackalign/setjmp-3.c -O2 (internal compiler error)
FAIL: gcc.dg/torture/stackalign/setjmp-3.c -O2 (test for excess errors)
UNRESOLVED: gcc.dg/torture/stackalign/setjmp-3.c -O2 compilation failed to produce executable
FAIL: gcc.dg/torture/stackalign/setjmp-3.c -O3 -fomit-frame-pointer (internal compiler error)
FAIL: gcc.dg/torture/stackalign/setjmp-3.c -O3 -fomit-frame-pointer (test for excess errors)
UNRESOLVED: gcc.dg/torture/stackalign/setjmp-3.c -O3 -fomit-frame-pointer compilation failed to produce executable
FAIL: gcc.dg/torture/stackalign/setjmp-3.c -O3 -fomit-frame-pointer -funroll-loops (internal compiler error)
FAIL: gcc.dg/torture/stackalign/setjmp-3.c -O3 -fomit-frame-pointer -funroll-loops (test for excess errors)
UNRESOLVED: gcc.dg/torture/stackalign/setjmp-3.c -O3 -fomit-frame-pointer -funroll-loops compilation failed to produce executable
FAIL: gcc.dg/torture/stackalign/setjmp-3.c -O3 -fomit-frame-pointer -funroll-all-loops -finline-functions (internal compiler error)
FAIL: gcc.dg/torture/stackalign/setjmp-3.c -O3 -fomit-frame-pointer -funroll-all-loops -finline-functions (test for excess errors)
UNRESOLVED: gcc.dg/torture/stackalign/setjmp-3.c -O3 -fomit-frame-pointer -funroll-all-loops -finline-functions compilation failed to produce executable
FAIL: gcc.dg/torture/stackalign/setjmp-3.c -O3 -g (internal compiler error)
FAIL: gcc.dg/torture/stackalign/setjmp-3.c -O3 -g (test for excess errors)
UNRESOLVED: gcc.dg/torture/stackalign/setjmp-3.c -O3 -g compilation failed to produce executable
FAIL: gcc.dg/torture/stackalign/setjmp-3.c -Os (internal compiler error)
FAIL: gcc.dg/torture/stackalign/setjmp-3.c -Os (test for excess errors)
UNRESOLVED: gcc.dg/torture/stackalign/setjmp-3.c -Os compilation failed to produce executable
FAIL: gcc.dg/torture/stackalign/setjmp-3.c -O2 -flto (internal compiler error)
FAIL: gcc.dg/torture/stackalign/setjmp-3.c -O2 -flto (test for excess errors)
UNRESOLVED: gcc.dg/torture/stackalign/setjmp-3.c -O2 -flto compilation failed to produce executable
FAIL: gcc.dg/torture/stackalign/setjmp-3.c -O2 -fwhopr (internal compiler error)
FAIL: gcc.dg/torture/stackalign/setjmp-3.c -O2 -fwhopr (test for excess errors)
UNRESOLVED: gcc.dg/torture/stackalign/setjmp-3.c -O2 -fwhopr compilation failed to produce executable
FAIL: gcc.dg/torture/stackalign/setjmp-4.c -O1 (internal compiler error)
FAIL: gcc.dg/torture/stackalign/setjmp-4.c -O1 (test for excess errors)
UNRESOLVED: gcc.dg/torture/stackalign/setjmp-4.c -O1 compilation failed to produce executable
FAIL: gcc.dg/torture/stackalign/setjmp-4.c -O2 (internal compiler error)
FAIL: gcc.dg/torture/stackalign/setjmp-4.c -O2 (test for excess errors)
UNRESOLVED: gcc.dg/torture/stackalign/setjmp-4.c -O2 compilation failed to produce executable
FAIL: gcc.dg/torture/stackalign/setjmp-4.c -O3 -fomit-frame-pointer (internal compiler error)
FAIL: gcc.dg/torture/stackalign/setjmp-4.c -O3 -fomit-frame-pointer (test for excess errors)
UNRESOLVED: gcc.dg/torture/stackalign/setjmp-4.c -O3 -fomit-frame-pointer compilation failed to produce executable
FAIL: gcc.dg/torture/stackalign/setjmp-4.c -O3 -fomit-frame-pointer -funroll-loops (internal compiler error)
FAIL: gcc.dg/torture/stackalign/setjmp-4.c -O3 -fomit-frame-pointer -funroll-loops (test for excess errors)
UNRESOLVED: gcc.dg/torture/stackalign/setjmp-4.c -O3 -fomit-frame-pointer -funroll-loops compilation failed to produce executable
FAIL: gcc.dg/torture/stackalign/setjmp-4.c -O3 -fomit-frame-pointer -funroll-all-loops -finline-functions (internal compiler error)
FAIL: gcc.dg/torture/stackalign/setjmp-4.c -O3 -fomit-frame-pointer -funroll-all-loops -finline-functions (test for excess errors)
UNRESOLVED: gcc.dg/torture/stackalign/setjmp-4.c -O3 -fomit-frame-pointer -funroll-all-loops -finline-functions compilation failed to produce executable
FAIL: gcc.dg/torture/stackalign/setjmp-4.c -O3 -g (internal compiler error)
FAIL: gcc.dg/torture/stackalign/setjmp-4.c -O3 -g (test for excess errors)
UNRESOLVED: gcc.dg/torture/stackalign/setjmp-4.c -O3 -g compilation failed to produce executable
FAIL: gcc.dg/torture/stackalign/setjmp-4.c -Os (internal compiler error)
FAIL: gcc.dg/torture/stackalign/setjmp-4.c -Os (test for excess errors)
UNRESOLVED: gcc.dg/torture/stackalign/setjmp-4.c -Os compilation failed to produce executable
FAIL: gcc.dg/torture/stackalign/setjmp-4.c -O2 -flto (internal compiler error)
FAIL: gcc.dg/torture/stackalign/setjmp-4.c -O2 -flto (test for excess errors)
UNRESOLVED: gcc.dg/torture/stackalign/setjmp-4.c -O2 -flto compilation failed to produce executable
FAIL: gcc.dg/torture/stackalign/setjmp-4.c -O2 -fwhopr (internal compiler error)
FAIL: gcc.dg/torture/stackalign/setjmp-4.c -O2 -fwhopr (test for excess errors)
UNRESOLVED: gcc.dg/torture/stackalign/setjmp-4.c -O2 -fwhopr compilation failed to produce executable
FAIL: gcc.dg/tree-prof/inliner-1.c scan-tree-dump-not optimized "hot_function ..;"
XPASS: gcc.dg/tree-ssa/20040204-1.c scan-tree-dump-times optimized "link_error" 0

=== gcc Summary for unix ===

# of expected passes 67594
# of unexpected failures 85
# of unexpected successes 1
# of expected failures 130
# of unresolved testcases 51
# of unsupported tests 937

Running target unix/-m64
FAIL: gcc.c-torture/execute/va-arg-13.c compilation, -O0 (internal compiler error)
UNRESOLVED: gcc.c-torture/execute/va-arg-13.c execution, -O0
FAIL: gcc.c-torture/execute/va-arg-14.c compilation, -O0 (internal compiler error)
UNRESOLVED: gcc.c-torture/execute/va-arg-14.c execution, -O0
FAIL: gcc.c-torture/execute/va-arg-14.c compilation, -O1 (internal compiler error)
UNRESOLVED: gcc.c-torture/execute/va-arg-14.c execution, -O1
FAIL: gcc.c-torture/execute/va-arg-14.c compilation, -O2 (internal compiler error)
UNRESOLVED: gcc.c-torture/execute/va-arg-14.c execution, -O2
FAIL: gcc.c-torture/execute/va-arg-14.c compilation, -O3 -fomit-frame-pointer (internal compiler error)
UNRESOLVED: gcc.c-torture/execute/va-arg-14.c execution, -O3 -fomit-frame-pointer
FAIL: gcc.c-torture/execute/va-arg-14.c compilation, -O3 -g (internal compiler error)
UNRESOLVED: gcc.c-torture/execute/va-arg-14.c execution, -O3 -g
FAIL: gcc.c-torture/execute/va-arg-14.c compilation, -Os (internal compiler error)
UNRESOLVED: gcc.c-torture/execute/va-arg-14.c execution, -Os
FAIL: gcc.c-torture/execute/va-arg-14.c compilation, -O2 -flto (internal compiler error)
UNRESOLVED: gcc.c-torture/execute/va-arg-14.c execution, -O2 -flto
FAIL: gcc.c-torture/execute/va-arg-14.c compilation, -O2 -fwhopr (internal compiler error)
UNRESOLVED: gcc.c-torture/execute/va-arg-14.c execution, -O2 -fwhopr
FAIL: gcc.c-torture/execute/va-arg-21.c compilation, -O0 (internal compiler error)
UNRESOLVED: gcc.c-torture/execute/va-arg-21.c execution, -O0
FAIL: gcc.c-torture/execute/va-arg-21.c compilation, -O1 (internal compiler error)
UNRESOLVED: gcc.c-torture/execute/va-arg-21.c execution, -O1
FAIL: gcc.c-torture/execute/va-arg-21.c compilation, -O2 (internal compiler error)
UNRESOLVED: gcc.c-torture/execute/va-arg-21.c execution, -O2
FAIL: gcc.c-torture/execute/va-arg-21.c compilation, -O3 -fomit-frame-pointer (internal compiler error)
UNRESOLVED: gcc.c-torture/execute/va-arg-21.c execution, -O3 -fomit-frame-pointer
FAIL: gcc.c-torture/execute/va-arg-21.c compilation, -O3 -fomit-frame-pointer -funroll-loops (internal compiler error)
UNRESOLVED: gcc.c-torture/execute/va-arg-21.c execution, -O3 -fomit-frame-pointer -funroll-loops
FAIL: gcc.c-torture/execute/va-arg-21.c compilation, -O3 -fomit-frame-pointer -funroll-all-loops -finline-functions (internal compiler error)
UNRESOLVED: gcc.c-torture/execute/va-arg-21.c execution, -O3 -fomit-frame-pointer -funroll-all-loops -finline-functions
FAIL: gcc.c-torture/execute/va-arg-21.c compilation, -O3 -g (internal compiler error)
UNRESOLVED: gcc.c-torture/execute/va-arg-21.c execution, -O3 -g
FAIL: gcc.c-torture/execute/va-arg-21.c compilation, -Os (internal compiler error)
UNRESOLVED: gcc.c-torture/execute/va-arg-21.c execution, -Os
FAIL: gcc.c-torture/execute/va-arg-21.c compilation, -O2 -flto (internal compiler error)
UNRESOLVED: gcc.c-torture/execute/va-arg-21.c execution, -O2 -flto
FAIL: gcc.c-torture/execute/va-arg-21.c compilation, -O2 -fwhopr (internal compiler error)
UNRESOLVED: gcc.c-torture/execute/va-arg-21.c execution, -O2 -fwhopr
FAIL: gcc.dg/dfp/pr41049.c execution test
FAIL: gcc.dg/cproj-fails-with-broken-glibc.c execution test
FAIL: gcc.dg/march.c (test for excess errors)
FAIL: gcc.dg/stack-usage-1.c (test for excess errors)
FAIL: gcc.dg/stack-usage-1.c scan-file foo (256|264) static
FAIL: gcc.dg/uninit-13.c unconditional (test for warnings, line 8)
FAIL: gcc.dg/uninit-13.c (test for excess errors)
FAIL: gcc.dg/uninit-pred-7_a.c bogus warning (test for bogus messages, line 26)
FAIL: gcc.dg/uninit-pred-8_a.c bogus warning (test for bogus messages, line 26)
UNRESOLVED: selfassign.c compilation, -I. -I/build/buildd-gcc-snapshot_20101016-1-s390-SUosHl/gcc-snapshot-20101016/src/gcc/testsuite -I/build/buildd-gcc-snapshot_20101016-1-s390-SUosHl/gcc-snapshot-20101016/src/gcc/testsuite/../../gcc -I/build/buildd-gcc-snapshot_20101016-1-s390-SUosHl/gcc-snapshot-20101016/build/gcc/testsuite/gcc/../../../gcc -I/build/buildd-gcc-snapshot_20101016-1-s390-SUosHl/gcc-snapshot-20101016/src/gcc/testsuite/../../include -I/build/buildd-gcc-snapshot_20101016-1-s390-SUosHl/gcc-snapshot-20101016/src/gcc/testsuite/../../libcpp/include -I/build/buildd-gcc-snapshot_20101016-1-s390-SUosHl/gcc-snapshot-20101016/build/gcc/testsuite/gcc/../../../intl -O -DIN_GCC -fPIC -shared
UNRESOLVED: ggcplug.c compilation, -I. -I/build/buildd-gcc-snapshot_20101016-1-s390-SUosHl/gcc-snapshot-20101016/src/gcc/testsuite -I/build/buildd-gcc-snapshot_20101016-1-s390-SUosHl/gcc-snapshot-20101016/src/gcc/testsuite/../../gcc -I/build/buildd-gcc-snapshot_20101016-1-s390-SUosHl/gcc-snapshot-20101016/build/gcc/testsuite/gcc/../../../gcc -I/build/buildd-gcc-snapshot_20101016-1-s390-SUosHl/gcc-snapshot-20101016/src/gcc/testsuite/../../include -I/build/buildd-gcc-snapshot_20101016-1-s390-SUosHl/gcc-snapshot-20101016/src/gcc/testsuite/../../libcpp/include -I/build/buildd-gcc-snapshot_20101016-1-s390-SUosHl/gcc-snapshot-20101016/build/gcc/testsuite/gcc/../../../intl -O -DIN_GCC -fPIC -shared
UNRESOLVED: one_time_plugin.c compilation, -I. -I/build/buildd-gcc-snapshot_20101016-1-s390-SUosHl/gcc-snapshot-20101016/src/gcc/testsuite -I/build/buildd-gcc-snapshot_20101016-1-s390-SUosHl/gcc-snapshot-20101016/src/gcc/testsuite/../../gcc -I/build/buildd-gcc-snapshot_20101016-1-s390-SUosHl/gcc-snapshot-20101016/build/gcc/testsuite/gcc/../../../gcc -I/build/buildd-gcc-snapshot_20101016-1-s390-SUosHl/gcc-snapshot-20101016/src/gcc/testsuite/../../include -I/build/buildd-gcc-snapshot_20101016-1-s390-SUosHl/gcc-snapshot-20101016/src/gcc/testsuite/../../libcpp/include -I/build/buildd-gcc-snapshot_20101016-1-s390-SUosHl/gcc-snapshot-20101016/build/gcc/testsuite/gcc/../../../intl -DIN_GCC -fPIC -shared
UNRESOLVED: start_unit_plugin.c compilation, -I. -I/build/buildd-gcc-snapshot_20101016-1-s390-SUosHl/gcc-snapshot-20101016/src/gcc/testsuite -I/build/buildd-gcc-snapshot_20101016-1-s390-SUosHl/gcc-snapshot-20101016/src/gcc/testsuite/../../gcc -I/build/buildd-gcc-snapshot_20101016-1-s390-SUosHl/gcc-snapshot-20101016/build/gcc/testsuite/gcc/../../../gcc -I/build/buildd-gcc-snapshot_20101016-1-s390-SUosHl/gcc-snapshot-20101016/src/gcc/testsuite/../../include -I/build/buildd-gcc-snapshot_20101016-1-s390-SUosHl/gcc-snapshot-20101016/src/gcc/testsuite/../../libcpp/include -I/build/buildd-gcc-snapshot_20101016-1-s390-SUosHl/gcc-snapshot-20101016/build/gcc/testsuite/gcc/../../../intl -DIN_GCC -fPIC -shared
UNRESOLVED: finish_unit_plugin.c compilation, -I. -I/build/buildd-gcc-snapshot_20101016-1-s390-SUosHl/gcc-snapshot-20101016/src/gcc/testsuite -I/build/buildd-gcc-snapshot_20101016-1-s390-SUosHl/gcc-snapshot-20101016/src/gcc/testsuite/../../gcc -I/build/buildd-gcc-snapshot_20101016-1-s390-SUosHl/gcc-snapshot-20101016/build/gcc/testsuite/gcc/../../../gcc -I/build/buildd-gcc-snapshot_20101016-1-s390-SUosHl/gcc-snapshot-20101016/src/gcc/testsuite/../../include -I/build/buildd-gcc-snapshot_20101016-1-s390-SUosHl/gcc-snapshot-20101016/src/gcc/testsuite/../../libcpp/include -I/build/buildd-gcc-snapshot_20101016-1-s390-SUosHl/gcc-snapshot-20101016/build/gcc/testsuite/gcc/../../../intl -DIN_GCC -fPIC -shared
FAIL: gcc.dg/tls/pr45870.c (test for excess errors)
FAIL: gcc.dg/tree-prof/inliner-1.c scan-tree-dump-not optimized "hot_function ..;"
XPASS: gcc.dg/tree-ssa/20040204-1.c scan-tree-dump-times optimized "link_error" 0
FAIL: gcc.dg/tree-ssa/pr42585.c scan-tree-dump-times optimized "struct _fat_ptr _ans" 0
FAIL: gcc.dg/tree-ssa/pr42585.c scan-tree-dump-times optimized "struct _fat_ptr _T2" 0
FAIL: gcc.target/s390/20020926-1.c (test for excess errors)
ERROR: gcc.target/s390/20020926-1.c: error executing dg-final: couldn't open "20020926-1.s": no such file or directory
UNRESOLVED: gcc.target/s390/20020926-1.c: error executing dg-final: couldn't open "20020926-1.s": no such file or directory

=== gcc Summary for unix/-m64 ===

# of expected passes 68301
# of unexpected failures 33
# of unexpected successes 1
# of expected failures 131
# of unresolved testcases 25
# of unsupported tests 926

=== gcc Summary ===

# of expected passes 135895
# of unexpected failures 118
# of unexpected successes 2
# of expected failures 261
# of unresolved testcases 76
# of unsupported tests 1863
/build/buildd-gcc-snapshot_20101016-1-s390-SUosHl/gcc-snapshot-20101016/build/gcc/xgcc version 4.6.0 20101016 (experimental) [trunk revision 165538] (Debian 20101016-1)

=== gfortran tests ===


Running target unix
FAIL: gfortran.dg/allocatable_scalar_5.f90 -O0 execution test

=== gfortran Summary for unix ===

# of expected passes 36207
# of unexpected failures 1
# of expected failures 53
# of unsupported tests 210

Running target unix/-m64
FAIL: gfortran.dg/pr25923.f90 -O PR45505 (test for warnings, line 13)
FAIL: gfortran.dg/pr25923.f90 -O PR45505 (test for bogus messages, line 22)

=== gfortran Summary for unix/-m64 ===

# of expected passes 36487
# of unexpected failures 2
# of expected failures 51
# of unsupported tests 73

=== gfortran Summary ===

# of expected passes 72694
# of unexpected failures 3
# of expected failures 104
# of unsupported tests 283
/build/buildd-gcc-snapshot_20101016-1-s390-SUosHl/gcc-snapshot-20101016/build/gcc/testsuite/gfortran/../../gfortran version 4.6.0 20101016 (experimental) [trunk revision 165538] (Debian 20101016-1)

=== gnat tests ===


Running target unix

=== gnat Summary for unix ===

# of expected passes 822
# of expected failures 10
# of unsupported tests 6

Running target unix/-m64
UNRESOLVED: gnat.dg/abstract_with_anonymous_result.adb compilation failed to produce executable
UNRESOLVED: gnat.dg/access4.adb compilation failed to produce executable
UNRESOLVED: gnat.dg/access_discr2.adb compilation failed to produce executable
UNRESOLVED: gnat.dg/access_test.adb compilation failed to produce executable
UNRESOLVED: gnat.dg/addr2.adb compilation failed to produce executable
UNRESOLVED: gnat.dg/address_conversion.adb compilation failed to produce executable
UNRESOLVED: gnat.dg/aggr1.adb compilation failed to produce executable
FAIL: gnat.dg/aggr12.adb scan-tree-dump-not original "{.i1=0, .i2=2}": dump file does not exist
FAIL: gnat.dg/aggr13.adb scan-tree-dump-not gimple "= {}": dump file does not exist
UNRESOLVED: gnat.dg/aggr14.adb compilation failed to produce executable
UNRESOLVED: gnat.dg/aggr3.adb compilation failed to produce executable
UNRESOLVED: gnat.dg/aliased_prefix_accessibility.adb compilation failed to produce executable
FAIL: gnat.dg/aliasing1.adb scan-tree-dump-not optimized "__gnat_rcheck": dump file does not exist
FAIL: gnat.dg/aliasing2.adb scan-tree-dump-not optimized "__gnat_rcheck": dump file does not exist
UNRESOLVED: gnat.dg/aliasing3.adb compilation failed to produce executable
UNRESOLVED: gnat.dg/align_check.adb compilation failed to produce executable
UNRESOLVED: gnat.dg/align_max.adb compilation failed to produce executable
UNRESOLVED: gnat.dg/aligned_vla.adb compilation failed to produce executable
UNRESOLVED: gnat.dg/alignment1.adb compilation failed to produce executable
UNRESOLVED: gnat.dg/alignment2.adb compilation failed to produce executable
FAIL: gnat.dg/alignment4.adb scan-tree-dump-not gimple ".F": dump file does not exist
FAIL: gnat.dg/alignment5.adb scan-tree-dump-not gimple ".F": dump file does not exist
FAIL: gnat.dg/alignment6.adb scan-tree-dump-not gimple "VIEW_CONVERT_EXPR": dump file does not exist
UNRESOLVED: gnat.dg/alignment7.adb compilation failed to produce executable
UNRESOLVED: gnat.dg/alignment8.adb compilation failed to produce executable
UNRESOLVED: gnat.dg/alignment9.adb compilation failed to produce executable
UNRESOLVED: gnat.dg/allocator_maxalign1.adb compilation failed to produce executable
FAIL: gnat.dg/ancestor_type.adb (test for errors, line 8)
UNRESOLVED: gnat.dg/array10.adb compilation failed to produce executable
FAIL: gnat.dg/array11.adb (test for warnings, line 8)
FAIL: gnat.dg/array11.adb (test for warnings, line 9)
FAIL: gnat.dg/array11.adb (test for warnings, line 12)
UNRESOLVED: gnat.dg/array12.adb compilation failed to produce executable
UNRESOLVED: gnat.dg/array3.adb compilation failed to produce executable
UNRESOLVED: gnat.dg/array4.adb compilation failed to produce executable
UNRESOLVED: gnat.dg/array5.adb compilation failed to produce executable
UNRESOLVED: gnat.dg/array6.adb compilation failed to produce executable
UNRESOLVED: gnat.dg/array9.adb compilation failed to produce executable
UNRESOLVED: gnat.dg/array_bounds_test.adb compilation failed to produce executable
UNRESOLVED: gnat.dg/assert1.adb compilation failed to produce executable
UNRESOLVED: gnat.dg/assign_from_packed.adb compilation failed to produce executable
FAIL: gnat.dg/atomic2.adb (test for warnings, line 7)
UNRESOLVED: gnat.dg/biased_uc.adb compilation failed to produce executable
UNRESOLVED: gnat.dg/bip_aggregate_bug.adb compilation failed to produce executable
UNRESOLVED: gnat.dg/bit_packed_array3.adb compilation failed to produce executable
UNRESOLVED: gnat.dg/blkextract_from_reg.adb compilation failed to produce executable
UNRESOLVED: gnat.dg/bltins.adb compilation failed to produce executable
UNRESOLVED: gnat.dg/boolean_bitfield.adb compilation failed to produce executable
UNRESOLVED: gnat.dg/boolean_expr2.adb compilation failed to produce executable
UNRESOLVED: gnat.dg/capture_value.adb compilation failed to produce executable
UNRESOLVED: gnat.dg/case_optimization2.adb compilation failed to produce executable
UNRESOLVED: gnat.dg/check_displace_generation.adb compilation failed to produce executable
UNRESOLVED: gnat.dg/check_elaboration_code.adb compilation failed to produce executable
UNRESOLVED: gnat.dg/compose.adb compilation failed to produce executable
UNRESOLVED: gnat.dg/concat1.adb compilation failed to produce executable
UNRESOLVED: gnat.dg/concat_length.adb compilation failed to produce executable
UNRESOLVED: gnat.dg/constant2.adb compilation failed to produce executable
UNRESOLVED: gnat.dg/controlled5.adb compilation failed to produce executable
UNRESOLVED: gnat.dg/conv_bug.adb compilation failed to produce executable
UNRESOLVED: gnat.dg/conv_decimal.adb compilation failed to produce executable
UNRESOLVED: gnat.dg/conv_real.adb compilation failed to produce executable
UNRESOLVED: gnat.dg/curr_task.adb compilation failed to produce executable
FAIL: gnat.dg/deferred_const1.adb (test for warnings, line 8)
UNRESOLVED: gnat.dg/deferred_const2.adb compilation failed to produce executable
UNRESOLVED: gnat.dg/deferred_const3.adb compilation failed to produce executable
UNRESOLVED: gnat.dg/derived_aggregate.adb compilation failed to produce executable
FAIL: gnat.dg/derived_type1.adb scan-tree-dump-not original "VIEW_CONVERT_EXPR<struct derived_type1__root>": dump file does not exist
FAIL: gnat.dg/derived_type1.adb scan-tree-dump-not original "VIEW_CONVERT_EXPR<struct derived_type1__derived1>": dump file does not exist
UNRESOLVED: gnat.dg/discr24.adb compilation failed to produce executable
UNRESOLVED: gnat.dg/discr4.adb compilation failed to produce executable
UNRESOLVED: gnat.dg/dispatch1.adb compilation failed to produce executable
UNRESOLVED: gnat.dg/dispatch2.adb compilation failed to produce executable
UNRESOLVED: gnat.dg/elim2.adb compilation failed to produce executable
UNRESOLVED: gnat.dg/empty_vector_length.adb compilation failed to produce executable
UNRESOLVED: gnat.dg/entry_queues.adb compilation failed to produce executable
UNRESOLVED: gnat.dg/enum1.adb compilation failed to produce executable
UNRESOLVED: gnat.dg/enum2.adb compilation failed to produce executable
UNRESOLVED: gnat.dg/exp0_eval.adb compilation failed to produce executable
UNRESOLVED: gnat.dg/expect1.adb compilation failed to produce executable
UNRESOLVED: gnat.dg/fixce.adb compilation failed to produce executable
UNRESOLVED: gnat.dg/fixedpnt.adb compilation failed to produce executable
FAIL: gnat.dg/frame_overflow.adb (test for errors, line 17)
FAIL: gnat.dg/frame_overflow.adb (test for errors, line 24)
UNRESOLVED: gnat.dg/generic_dispatch.adb compilation failed to produce executable
UNRESOLVED: gnat.dg/gnat_malloc.adb compilation failed to produce executable
UNRESOLVED: gnat.dg/handle_and_return.adb compilation failed to produce executable
UNRESOLVED: gnat.dg/handle_raise_from_pure.adb compilation failed to produce executable
UNRESOLVED: gnat.dg/hyper_flat.adb compilation failed to produce executable
UNRESOLVED: gnat.dg/in_out_parameter.adb compilation failed to produce executable
XPASS: gnat.dg/incomplete2.adb (test for excess errors)
UNRESOLVED: gnat.dg/init_scalar1.adb compilation failed to produce executable
UNRESOLVED: gnat.dg/inline_tagged.adb compilation failed to produce executable
UNRESOLVED: gnat.dg/interface1.adb compilation failed to produce executable
UNRESOLVED: gnat.dg/interface2.adb compilation failed to produce executable
UNRESOLVED: gnat.dg/interface3.adb compilation failed to produce executable
UNRESOLVED: gnat.dg/interface_conv.adb compilation failed to produce executable
UNRESOLVED: gnat.dg/iprot_test.adb compilation failed to produce executable
UNRESOLVED: gnat.dg/kill_value.adb compilation failed to produce executable
UNRESOLVED: gnat.dg/lhs_view_convert.adb compilation failed to produce executable
UNRESOLVED: gnat.dg/loop_boolean.adb compilation failed to produce executable
UNRESOLVED: gnat.dg/loop_optimization3.adb compilation failed to produce executable
UNRESOLVED: gnat.dg/loop_optimization4.adb compilation failed to produce executable
UNRESOLVED: gnat.dg/lto1.adb compilation failed to produce executable
UNRESOLVED: gnat.dg/lto10.adb compilation failed to produce executable
UNRESOLVED: gnat.dg/lto5.adb compilation failed to produce executable
UNRESOLVED: gnat.dg/lto6.adb compilation failed to produce executable
UNRESOLVED: gnat.dg/lto7.adb compilation failed to produce executable
UNRESOLVED: gnat.dg/lto8.adb compilation failed to produce executable
UNRESOLVED: gnat.dg/lto9.adb compilation failed to produce executable
UNRESOLVED: gnat.dg/md5_test.adb compilation failed to produce executable
ERROR: gnat.dg/memtrap.adb: error executing dg-final: couldn't open "memtrap.s": no such file or directory
UNRESOLVED: gnat.dg/memtrap.adb: error executing dg-final: couldn't open "memtrap.s": no such file or directory
UNRESOLVED: gnat.dg/misaligned_nest.adb compilation failed to produce executable
UNRESOLVED: gnat.dg/misaligned_param.adb compilation failed to produce executable
UNRESOLVED: gnat.dg/missing_acc_check.adb compilation failed to produce executable
UNRESOLVED: gnat.dg/modular1.adb compilation failed to produce executable
UNRESOLVED: gnat.dg/modular2.adb compilation failed to produce executable
UNRESOLVED: gnat.dg/modular3.adb compilation failed to produce executable
UNRESOLVED: gnat.dg/mutable1.adb compilation failed to produce executable
UNRESOLVED: gnat.dg/named_test.adb compilation failed to produce executable
UNRESOLVED: gnat.dg/nat1r.adb compilation failed to produce executable
UNRESOLVED: gnat.dg/nested_controlled_alloc.adb compilation failed to produce executable
UNRESOLVED: gnat.dg/nested_proc1.adb compilation failed to produce executable
UNRESOLVED: gnat.dg/nested_return_test.adb compilation failed to produce executable
UNRESOLVED: gnat.dg/no_final.adb compilation failed to produce executable
UNRESOLVED: gnat.dg/not_null.adb compilation failed to produce executable
FAIL: gnat.dg/notnot.adb (test for warnings, line 6)
UNRESOLVED: gnat.dg/null_pointer_d
 

Thread Tools




All times are GMT. The time now is 10:48 AM.

VBulletin, Copyright ©2000 - 2014, Jelsoft Enterprises Ltd.
Content Relevant URLs by vBSEO ©2007, Crawlability, Inc.
Copyright 2007 - 2008, www.linux-archive.org