FAQ Search Today's Posts Mark Forums Read
» Video Reviews

» Linux Archive

Linux-archive is a website aiming to archive linux email lists and to make them easily accessible for linux users/developers.


» Sponsor

» Partners

» Sponsor

Go Back   Linux Archive > ArchLinux > ArchLinux General Discussion

 
 
LinkBack Thread Tools
 
Old 10-15-2011, 04:13 PM
"Alessio 'Blaster' Biancalana"
 
Default OpenVAS in AUR not compiling

Hello guys,
I require you to test some stuff.

Trying to compile OpenVAS, I get Error 2 or some other things.
Now I ask, it's my fault or...?

Let me know if openvas-libraries in AUR builds fine for you

--
Bl@ster / dottorblaster
 
Old 10-15-2011, 04:30 PM
Karol Blazewicz
 
Default OpenVAS in AUR not compiling

On Sat, Oct 15, 2011 at 6:13 PM, Alessio 'Blaster' Biancalana
<dottorblaster@archlinux.us> wrote:
> Hello guys,
> I require you to test some stuff.
>
> Trying to compile OpenVAS, I get Error 2 or some other things.
> Now I ask, it's my fault or...?
>
> Let me know if openvas-libraries in AUR builds fine for you
>
> --
> Bl@ster / dottorblaster
>

I think it's the wrong list - you should ask on aur-general as it's an
aur package. Post this error on the AUR page of that package too - the
maintainer may be able to help you.

I got

Linking C static library libopenvas_nasl.a
[ 73%] Built target openvas_nasl_static
Scanning dependencies of target openvas-nasl
[ 73%] Building C object nasl/CMakeFiles/openvas-nasl.dir/nasl.c.o
Linking C executable openvas-nasl
../misc/libopenvas_misc.a(network.c.o): In function `open_SSL_connection':
/home/karol/test/makepkg/src/openvas-libraries-4.0.5/misc/network.c:828:
undefined reference to `gnutls_transport_set_lowat'
collect2: ld returned 1 exit status
make[2]: *** [nasl/openvas-nasl] Error 1
make[1]: *** [nasl/CMakeFiles/openvas-nasl.dir/all] Error 2
make: *** [all] Error 2
==> ERROR: A failure occurred in build().
Aborting...
 
Old 10-15-2011, 04:38 PM
Ionut Biru
 
Default OpenVAS in AUR not compiling

On 10/15/2011 07:30 PM, Karol Blazewicz wrote:

On Sat, Oct 15, 2011 at 6:13 PM, Alessio 'Blaster' Biancalana
<dottorblaster@archlinux.us> wrote:

Hello guys,
I require you to test some stuff.

Trying to compile OpenVAS, I get Error 2 or some other things.
Now I ask, it's my fault or...?

Let me know if openvas-libraries in AUR builds fine for you

--
Bl@ster / dottorblaster



I think it's the wrong list - you should ask on aur-general as it's an
aur package. Post this error on the AUR page of that package too - the
maintainer may be able to help you.

I got

Linking C static library libopenvas_nasl.a
[ 73%] Built target openvas_nasl_static
Scanning dependencies of target openvas-nasl
[ 73%] Building C object nasl/CMakeFiles/openvas-nasl.dir/nasl.c.o
Linking C executable openvas-nasl
../misc/libopenvas_misc.a(network.c.o): In function `open_SSL_connection':
/home/karol/test/makepkg/src/openvas-libraries-4.0.5/misc/network.c:828:
undefined reference to `gnutls_transport_set_lowat'
collect2: ld returned 1 exit status
make[2]: *** [nasl/openvas-nasl] Error 1
make[1]: *** [nasl/CMakeFiles/openvas-nasl.dir/all] Error 2
make: *** [all] Error 2
==> ERROR: A failure occurred in build().
Aborting...



gnutls_transport_set_lowat is deprecated in gnutls 3.0. To fix this
issue you have to patch the sources and remove entire that line.


--
IonuČ›
 

Thread Tools




All times are GMT. The time now is 02:27 AM.

VBulletin, Copyright ©2000 - 2014, Jelsoft Enterprises Ltd.
Content Relevant URLs by vBSEO ©2007, Crawlability, Inc.
Copyright ©2007 - 2008, www.linux-archive.org